[Bug 187799] Review Request: perl-Cairo - Perl interface to the cairo library

bugzilla at redhat.com bugzilla at redhat.com
Thu Apr 13 16:19:39 UTC 2006

Please do not reply directly to this email. All additional
comments should be made in the comments box of this bug report.

Summary: Review Request: perl-Cairo - Perl interface to the cairo library


tibbs at math.uh.edu changed:

           What    |Removed                     |Added
             Status|NEW                         |ASSIGNED
         AssignedTo|bugzilla-sink at leemhuis.info |tibbs at math.uh.edu
OtherBugsDependingO|163776                      |163778
              nThis|                            |

------- Additional Comments From tibbs at math.uh.edu  2006-04-13 12:19 EST -------

BuildRequires: perl is not permitted.  (This rule might change today.)

The build fails in mock (development branch and FC5, i386 and x86_64).  However,
it does run outside of mock on FC5 i386.  Perhaps there's a missing BuildRequires:?

+ make test
PERL_DL_NONLAZY=1 /usr/bin/perl "-MExtUtils::Command::MM" "-e" "test_harness(0,
'blib/lib', 'blib/arch')" t/*.t
#   Failed test in t/Cairo.t at line 178.
#          got: 'no-memory'
#     expected: 'success'
# Looks like you failed 1 test of 50.
        Test returned status 1 (wstat 256, 0x100)
DIED. FAILED test 50
        Failed 1/50 tests, 98.00% okay
#   Failed test 'The object isa Cairo::ScaledFont'
#   in t/CairoFont.t at line 56.
#     The object isn't defined
Can't call method "status" on an undefined value at t/CairoFont.t line 57.
# Looks like you planned 13 tests but only ran 10.
# Looks like you failed 1 test of 10 run.
# Looks like your test died just after 10.
        Test returned status 255 (wstat 65280, 0xff00)
DIED. FAILED tests 10-13
        Failed 4/13 tests, 69.23% okay
        8/19 skipped: various reasons
Failed Test   Stat Wstat Total Fail  Failed  List of Failed
t/Cairo.t        1   256    50    1   2.00%  50
t/CairoFont.t  255 65280    13    7  53.85%  10-13
8 subtests skipped.
Failed 2/6 test scripts, 66.67% okay. 5/112 subtests failed, 95.54% okay.
make: *** [test_dynamic] Error 255
error: Bad exit status from /var/tmp/rpm-tmp.83677 (%check)

Configure bugmail: https://bugzilla.redhat.com/bugzilla/userprefs.cgi?tab=email
------- You are receiving this mail because: -------
You are the QA contact for the bug, or are watching the QA contact.

More information about the fedora-extras-list mailing list