[Date Prev][Date Next]   [Thread Prev][Thread Next]   [Thread Index] [Date Index] [Author Index]

[Bug 177567] Review Request: smb4k - The SMB/CIFS Share Browser for KDE



Please do not reply directly to this email. All additional
comments should be made in the comments box of this bug report.

Summary: Review Request: smb4k - The SMB/CIFS Share Browser for KDE


https://bugzilla.redhat.com/bugzilla/show_bug.cgi?id=177567





------- Additional Comments From mgarski post pl  2006-01-16 07:06 EST -------
It's strange. I've added --disable-dependency-tracking & --enable-final to
Krusader's configure (in devel tree) and compilation failed with errors like:
/usr/include/stdlib.h:626: error: ambiguates old declaration 'void abort()'
/usr/lib/qt-3.3/include/qprinter.h:151: error: non-member function 'bool
aborted()' cannot have cv-qualifier
/usr/lib/qt-3.3/include/qprinter.h:155: error: non-member function 'PaperSource
paperSource()' cannot have cv-qualifier
/usr/lib/qt-3.3/include/qprinter.h:156: error: virtual outside class declaration

I've removed --disable-dependency-tracking, the same errors occur, then remove
--enable-final and compilation went fine, I didn't checked what will happen with
--disable-dependency-tracking only.

-- 
Configure bugmail: https://bugzilla.redhat.com/bugzilla/userprefs.cgi?tab=email
------- You are receiving this mail because: -------
You are on the CC list for the bug, or are watching someone who is.


[Date Prev][Date Next]   [Thread Prev][Thread Next]   [Thread Index] [Date Index] [Author Index]