[Date Prev][Date Next]   [Thread Prev][Thread Next]   [Thread Index] [Date Index] [Author Index]

segmentation fault on buildsystem



While attempting to fix bug #193476 (missing BuildRequires) - build
failed with a segmentation fault:

http://buildsys.fedoraproject.org/logs/fedora-development-extras/10383-gtkhtml36-3.6.2-5.fc6/i386/build.log

ranlib .libs/libgtkhtml-a11y.a
/usr/bin/libtool: line 5906:  7510 Segmentation fault      ranlib .libs/libgtkhtml-a11y.a
make[2]: *** [libgtkhtml-a11y.la] Error 139
make[2]: Leaving directory `/builddir/build/BUILD/gtkhtml-3.6.2/a11y'
make[1]: *** [all-recursive] Error 1
make[1]: Leaving directory `/builddir/build/BUILD/gtkhtml-3.6.2'
make: *** [all] Error 2

-=-

Is that a Build System issue?


[Date Prev][Date Next]   [Thread Prev][Thread Next]   [Thread Index] [Date Index] [Author Index]