[Date Prev][Date Next]   [Thread Prev][Thread Next]   [Thread Index] [Date Index] [Author Index]

Re: Tracking down broken dependencies in devel



The cyrus packages are in CVS and tagged byt fail to build due to
changes in the Berkeley DB libraries:

gcc -c -I.. -I/usr/include/db4 -I/usr/kerberos/include
-I/usr/include/et -I/usr/include   -DHAVE_CONFIG_H
-I/usr/kerberos/include   -O2 -g -pipe -Wall -Wp,-D_FORTIFY_SOURCE=2
-fexceptions -fstack-protector --param=ssp-buffer-size=4 -m64
-mtune=generic -fPIC  \
        cyrusdb_berkeley.c
cyrusdb_berkeley.c: In function 'init':
cyrusdb_berkeley.c:176: error: 'DB_ENV' has no member named 'set_lk_max'
cyrusdb_berkeley.c: In function 'myarchive':
cyrusdb_berkeley.c:301: warning: implicit declaration of function 'strlcpy'
make[1]: *** [cyrusdb_berkeley.o] Error 1
make[1]: Leaving directory `/builddir/build/BUILD/cyrus-imapd-2.3.7/lib'
make: *** [all] Error 1

 - J<


[Date Prev][Date Next]   [Thread Prev][Thread Next]   [Thread Index] [Date Index] [Author Index]