kernel 2054 is really broke!

Dan Gabriel Ghita gabbath at
Thu Mar 16 11:41:48 UTC 2006

same problem here, /var/log/nvidia-installer.log says this:

   include/asm/io.h: In function 'check_signature':
   include/asm/io.h:258: warning: wrong type argument to increment
   In file included from /tmp/selfgz8555/NVIDIA-Linux-x86-1.0-8178-pkg1

   warning: #warning " failed, assuming remap_page_range(4)!"
   function 'os_set_mlock_capability':
   5: error: 'struct task_struct' has no member named 'rlim'
   make[4]: *** [/tmp/selfgz8555/NVIDIA-Linux-x86-1.0-8178-pkg1
   nterface.o] Error 1
   make[3]: *** [_module_/tmp/selfgz8555/NVIDIA-Linux-x86-1.0-8178-pkg1
   /nv] Error 2
   make[2]: *** [modules] Error 2
   nvidia.ko failed to build!
   make[1]: *** [mdl] Error 1
   make: *** [module] Error 2
-> Error.
ERROR: Unable to build the NVIDIA kernel module.

sorry if i pasted more lines than i should
-------------- next part --------------
An HTML attachment was scrubbed...
URL: <>

More information about the fedora-test-list mailing list