[Date Prev][Date Next]   [Thread Prev][Thread Next]   [Thread Index] [Date Index] [Author Index]

[Libvirt-ci] Build failed in Jenkins: libvirt-master- rpm » libvirt-fedora-24 #496



See <https://ci.centos.org/job/libvirt-master-rpm/systems=libvirt-fedora-24/496/display/redirect>

------------------------------------------
[...truncated 341.93 KB...]
+ for i in nodeinfotest seclabeltest
+ rm -f nodeinfotest
+ printf 'int main(void) { return 0; }'
+ printf '#!/bin/sh\nexit 0\n'
+ chmod +x nodeinfotest
+ for i in nodeinfotest seclabeltest
+ rm -f seclabeltest
+ printf 'int main(void) { return 0; }'
+ printf '#!/bin/sh\nexit 0\n'
+ chmod +x seclabeltest
+ make -j2 check VIR_TEST_DEBUG=1
make  libshunload.la virportallocatormock.la virnetdaemonmock.la virnetserverclientmock.la vircgroupmock.la virpcimock.la virnetdevmock.la virrandommock.la virhostcpumock.la domaincapsmock.la virfilecachemock.la  virusbmock.la virnetdevbandwidthmock.la virnumamock.la virtestmock.la  virdbusmock.la virmocklibxl.la libqemumonitortestutils.la libqemutestdriver.la qemuxml2argvmock.la qemucaps2xmlmock.la qemucapsprobemock.la qemucpumock.la   nssmock.la virdeterministichashmock.la libsecurityselinuxhelper.la virshtest sockettest virhostcputest virbuftest commandtest seclabeltest virhashtest virconftest viratomictest utiltest shunloadtest virtimetest viruritest virkeyfiletest viralloctest virauthconfigtest virbitmaptest vircgrouptest vircryptotest virpcitest virendiantest virfiletest virfilecachetest virfirewalltest viriscsitest virkeycodetest virlockspacetest virlogtest virrotatingfiletest virschematest virstringtest virportallocatortest sysinfotest virkmodtest vircapstest domaincapstest domainconftest virhostdevtest virnetdevtest virtypedparamtest virnetmessagetest virnetsockettest virnetdaemontest virnetserverclienttest virnettlscontexttest virnettlssessiontest fchosttest scsihosttest vircaps2xmltest fdstreamtest virdbustest virsystemdtest virpolkittest securityselinuxtest viridentitytest securityselinuxlabeltest xml2sexprtest sexpr2xmltest xmconfigtest xencapstest xlconfigtest libxlxml2domconfigtest qemuxml2argvtest qemuxml2xmltest qemuargv2xmltest qemuhelptest domainsnapshotxml2xmltest qemumonitortest qemumonitorjsontest qemuhotplugtest qemuagenttest qemucapabilitiestest qemucaps2xmltest qemumemlocktest qemucommandutiltest lxcxml2xmltest lxcconf2xmltest openvzutilstest esxutilstest vboxsnapshotxmltest vmx2xmltest xml2vmxtest vmwarevertest   virjsontest networkxml2xmltest networkxml2xmlupdatetest networkxml2conftest networkxml2firewalltest storagebackendsheepdogtest nwfilterxml2xmltest nwfilterebiptablestest nwfilterxml2firewalltest storagevolxml2argvtest virstorageutiltest virstoragetest virscsitest nsstest nssguesttest storagevolxml2xmltest storagepoolxml2xmltest nodedevxml2xmltest interfacexml2xmltest cputest metadatatest secretxml2xmltest genericxml2xmltest virusbtest virnetdevbandwidthtest eventtest virdrivermoduletest objecteventtest virmacmaptest commandhelper ssh qemucapsprobe nsslinktest nssguestlinktest
make[1]: Entering directory '<https://ci.centos.org/job/libvirt-master-rpm/systems=libvirt-fedora-24/ws/build/rpmbuild/BUILD/libvirt-3.7.0/tests'>
  CC       shunloadhelper.lo
  CC       virportallocatormock_la-virportallocatormock.lo
  CC       virnetdaemonmock_la-virnetdaemonmock.lo
  CC       virnetserverclientmock_la-virnetserverclientmock.lo
  CC       vircgroupmock_la-vircgroupmock.lo
  CC       virpcimock_la-virpcimock.lo
  CC       virnetdevmock_la-virnetdevmock.lo
  CC       virrandommock_la-virrandommock.lo
  CC       virhostcpumock_la-virhostcpumock.lo
  CC       domaincapsmock_la-domaincapsmock.lo
  CC       virfilecachemock_la-virfilecachemock.lo
  CC       virusbmock_la-virusbmock.lo
  CC       virnetdevbandwidthmock_la-virnetdevbandwidthmock.lo
  CC       virnumamock_la-virnumamock.lo
  CC       virtestmock_la-virtestmock.lo
  CC       virdbusmock_la-virdbusmock.lo
  CC       virmocklibxl_la-virmocklibxl.lo
  CC       qemumonitortestutils.lo
  CCLD     libqemutestdriver.la
  CC       qemuxml2argvmock_la-qemuxml2argvmock.lo
  CC       qemucaps2xmlmock_la-qemucaps2xmlmock.lo
  CC       qemucapsprobemock_la-qemucapsprobemock.lo
  CC       qemucpumock_la-qemucpumock.lo
  CC       nssmock_la-nssmock.lo
  CC       virdeterministichashmock_la-virdeterministichashmock.lo
  CC       securityselinuxhelper.lo
  CC       virshtest.o
  CC       testutils.o
  CC       sockettest.o
  CC       virhostcputest.o
  CC       virfilewrapper.o
  CC       virbuftest.o
  CC       commandtest.o
  CC       seclabeltest.o
  CC       virhashtest.o
  CC       virconftest.o
  CC       viratomictest.o
  CC       utiltest.o
  CC       shunloadtest.o
  CC       virtimetest.o
  CC       viruritest.o
  CC       virkeyfiletest.o
  CC       viralloctest.o
  CC       virauthconfigtest.o
  CC       virbitmaptest.o
  CC       vircgrouptest.o
  CC       vircryptotest.o
  CC       virpcitest.o
  CC       virendiantest.o
  CC       virfiletest.o
  CC       virfilecachetest.o
  CC       virfirewalltest-virfirewalltest.o
  CC       virfirewalltest-testutils.o
  CC       viriscsitest.o
  CC       virkeycodetest.o
  CC       virlockspacetest.o
  CC       virlogtest.o
  CC       virrotatingfiletest-virrotatingfiletest.o
  CC       virrotatingfiletest-testutils.o
  CC       virschematest.o
  CC       virstringtest.o
  CC       virportallocatortest.o
  CC       sysinfotest.o
  CC       virkmodtest.o
  CC       vircapstest.o
  CC       testutilslxc.o
  CC       testutilsqemu.o
  CC       testutilsxen.o
  CC       domaincapstest.o
  CC       domainconftest.o
  CC       virhostdevtest.o
  CC       virnetdevtest-virnetdevtest.o
  CC       virnetdevtest-testutils.o
  CC       virtypedparamtest.o
  CC       virnetmessagetest-virnetmessagetest.o
  CC       virnetmessagetest-testutils.o
  CC       virnetsockettest.o
  CC       virnetdaemontest-virnetdaemontest.o
  CC       virnetdaemontest-testutils.o
  CC       virnetserverclienttest-virnetserverclienttest.o
  CC       virnetserverclienttest-testutils.o
  CC       virnettlscontexttest.o
  CC       virnettlshelpers.o
  CC       pkix_asn1_tab.o
  CC       virnettlssessiontest.o
  CC       fchosttest.o
  CC       scsihosttest.o
  CC       vircaps2xmltest.o
  CC       fdstreamtest.o
  CC       virdbustest-virdbustest.o
  CC       virdbustest-testutils.o
  CC       virsystemdtest-virsystemdtest.o
  CC       virsystemdtest-testutils.o
  CC       virpolkittest-virpolkittest.o
  CC       virpolkittest-testutils.o
  CC       securityselinuxtest.o
  CC       viridentitytest.o
  CC       securityselinuxlabeltest.o
  CC       xml2sexprtest.o
  CC       sexpr2xmltest.o
  CC       xmconfigtest.o
  CC       xencapstest.o
  CC       xlconfigtest.o
  CC       libxlxml2domconfigtest.o
  CC       qemuxml2argvtest.o
  CC       qemuxml2xmltest.o
  CC       qemuargv2xmltest.o
  CC       qemuhelptest.o
  CC       domainsnapshotxml2xmltest.o
  CC       qemumonitortest.o
  CC       qemumonitorjsontest.o
  CC       qemuhotplugtest.o
  CC       qemuagenttest.o
  CC       qemucapabilitiestest.o
  CC       qemucaps2xmltest.o
  CC       qemumemlocktest.o
  CC       qemucommandutiltest.o
  CC       lxcxml2xmltest.o
  CC       lxcconf2xmltest.o
  CC       openvzutilstest.o
  CC       esxutilstest.o
  CC       vboxsnapshotxmltest.o
  CC       vmx2xmltest.o
  CC       xml2vmxtest.o
  CC       vmwarevertest.o
  CC       virjsontest.o
  CC       networkxml2xmltest.o
  CC       networkxml2xmlupdatetest.o
  CC       networkxml2conftest.o
  CC       networkxml2firewalltest.o
  CC       storagebackendsheepdogtest.o
  CC       nwfilterxml2xmltest.o
  CC       nwfilterebiptablestest.o
  CC       nwfilterxml2firewalltest.o
  CC       storagevolxml2argvtest.o
  CC       virstorageutiltest.o
  CC       virstoragetest.o
  CC       virscsitest.o
  CC       nsstest-nsstest.o
  CC       nsstest-testutils.o
  CC       nssguesttest-nsstest.o
  CC       nssguesttest-testutils.o
  CC       storagevolxml2xmltest.o
  CC       storagepoolxml2xmltest.o
  CC       nodedevxml2xmltest.o
  CC       interfacexml2xmltest.o
  CC       cputest.o
  CC       metadatatest.o
  CC       secretxml2xmltest.o
  CC       genericxml2xmltest.o
  CC       virusbtest.o
  CC       virnetdevbandwidthtest.o
  CC       eventtest.o
  CC       virdrivermoduletest.o
  CC       objecteventtest.o
  CC       virmacmaptest.o
  CC       commandhelper.o
  CC       ssh.o
  CC       qemucapsprobe.o
  CC       nsslinktest-nsslinktest.o
  CC       nssguestlinktest-nsslinktest.o
  CCLD     libshunload.la
  CCLD     virportallocatormock.la
  CCLD     virnetdaemonmock.la
  CCLD     virnetserverclientmock.la
  CCLD     vircgroupmock.la
  CCLD     virpcimock.la
  CCLD     virnetdevmock.la
  CCLD     virrandommock.la
  CCLD     virhostcpumock.la
  CCLD     domaincapsmock.la
  CCLD     virfilecachemock.la
  CCLD     virusbmock.la
  CCLD     virnetdevbandwidthmock.la
  CCLD     virnumamock.la
  CCLD     virtestmock.la
  CCLD     virdbusmock.la
  CCLD     virmocklibxl.la
  CCLD     libqemumonitortestutils.la
  CCLD     qemuxml2argvmock.la
  CCLD     qemucaps2xmlmock.la
  CCLD     qemucapsprobemock.la
  CCLD     qemucpumock.la
  CCLD     nssmock.la
  CCLD     virdeterministichashmock.la
  CCLD     libsecurityselinuxhelper.la
  CCLD     virshtest
  CCLD     sockettest
  CCLD     virhostcputest
  CCLD     virbuftest
  CCLD     commandtest
  CCLD     seclabeltest
  CCLD     virhashtest
  CCLD     virconftest
../libtool: fork: retry: No child processes
../libtool: fork: retry: No child processes
../libtool: fork: retry: No child processes
../libtool: fork: retry: No child processes
../libtool: fork: retry: No child processes
../libtool: fork: retry: No child processes
../libtool: fork: retry: No child processes
../libtool: fork: retry: No child processes
../libtool: fork: retry: No child processes
../libtool: fork: Resource temporarily unavailable
Makefile:5041: recipe for target 'virhashtest' failed
make[1]: *** [virhashtest] Error 254
make[1]: *** Waiting for unfinished jobs....
../libtool: fork: retry: No child processes
../libtool: fork: retry: Resource temporarily unavailable
../libtool: fork: retry: No child processes
../libtool: fork: retry: No child processes
../libtool: fork: retry: No child processes
../libtool: fork: retry: No child processes
../libtool: fork: retry: No child processes
../libtool: fork: Resource temporarily unavailable
../libtool: fork: retry: No child processes
../libtool: fork: retry: No child processes
../libtool: fork: retry: No child processes
../libtool: fork: retry: No child processes
../libtool: fork: Resource temporarily unavailable
Makefile:5009: recipe for target 'virconftest' failed
make[1]: *** [virconftest] Error 254
make[1]: Leaving directory '<https://ci.centos.org/job/libvirt-master-rpm/systems=libvirt-fedora-24/ws/build/rpmbuild/BUILD/libvirt-3.7.0/tests'>
Makefile:7077: recipe for target 'check-am' failed
make: *** [check-am] Error 2
+ cat test-suite.log
/var/tmp/rpm-tmp.94iwUq: fork: retry: No child processes
cat: test-suite.log: No such file or directory
+ true
+ exit 1
error: Bad exit status from /var/tmp/rpm-tmp.94iwUq (%check)


RPM build errors:
    Bad exit status from /var/tmp/rpm-tmp.94iwUq (%check)
Build step 'Execute shell' marked build as failure


[Date Prev][Date Next]   [Thread Prev][Thread Next]   [Thread Index] [Date Index] [Author Index]