[Date Prev][Date Next]   [Thread Prev][Thread Next]   [Thread Index] [Date Index] [Author Index]

[Libvirt-ci] Build failed in Jenkins: libvirt-master- rpm » libvirt-fedora-rawhide #543



See <https://ci.centos.org/job/libvirt-master-rpm/systems=libvirt-fedora-rawhide/543/display/redirect>

------------------------------------------
[...truncated 354.86 KB...]
  CCLD     lxcconf2xmltest
  CCLD     openvzutilstest
  CCLD     esxutilstest
  CCLD     vboxsnapshotxmltest
  CCLD     vmx2xmltest
  CCLD     xml2vmxtest
  CCLD     vmwarevertest
  CCLD     virjsontest
  CCLD     networkxml2xmltest
  CCLD     networkxml2xmlupdatetest
  CCLD     networkxml2conftest
  CCLD     networkxml2firewalltest
  CCLD     storagebackendsheepdogtest
  CCLD     nwfilterxml2xmltest
  CCLD     nwfilterebiptablestest
  CCLD     nwfilterxml2firewalltest
  CCLD     storagevolxml2argvtest
  CCLD     virstorageutiltest
  CCLD     virstoragetest
  CCLD     virscsitest
  CCLD     nsstest
  CCLD     nssguesttest
  CCLD     storagevolxml2xmltest
  CCLD     storagepoolxml2xmltest
  CCLD     nodedevxml2xmltest
  CCLD     interfacexml2xmltest
  CCLD     cputest
  CCLD     metadatatest
  CCLD     secretxml2xmltest
  CCLD     genericxml2xmltest
  CCLD     virusbtest
  CCLD     virnetdevbandwidthtest
  CCLD     eventtest
  CCLD     virdrivermoduletest
  CCLD     objecteventtest
  CCLD     virmacmaptest
  CCLD     commandhelper
  CCLD     ssh
  CCLD     qemucapsprobe
  CCLD     nsslinktest
  CCLD     nssguestlinktest
make[1]: Leaving directory '<https://ci.centos.org/job/libvirt-master-rpm/systems=libvirt-fedora-rawhide/ws/build/rpmbuild/BUILD/libvirt-3.7.0/tests'>
make  check-TESTS
make[1]: Entering directory '<https://ci.centos.org/job/libvirt-master-rpm/systems=libvirt-fedora-rawhide/ws/build/rpmbuild/BUILD/libvirt-3.7.0/tests'>
make[2]: Entering directory '<https://ci.centos.org/job/libvirt-master-rpm/systems=libvirt-fedora-rawhide/ws/build/rpmbuild/BUILD/libvirt-3.7.0/tests'>
PASS: sockettest
PASS: virhostcputest
PASS: virbuftest
PASS: commandtest
PASS: seclabeltest
PASS: virhashtest
PASS: virconftest
PASS: viratomictest
PASS: utiltest
PASS: shunloadtest
PASS: virshtest
PASS: virtimetest
PASS: viruritest
PASS: virkeyfiletest
PASS: viralloctest
PASS: virauthconfigtest
PASS: virbitmaptest
PASS: vircgrouptest
PASS: vircryptotest
PASS: virpcitest
PASS: virendiantest
PASS: virfilecachetest
PASS: virfiletest
PASS: viriscsitest
PASS: virfirewalltest
PASS: virkeycodetest
PASS: virlockspacetest
PASS: virlogtest
PASS: virrotatingfiletest
PASS: virstringtest
PASS: virportallocatortest
PASS: sysinfotest
PASS: virkmodtest
PASS: vircapstest
PASS: domaincapstest
PASS: virschematest
PASS: domainconftest
PASS: virhostdevtest
PASS: virnetdevtest
PASS: virtypedparamtest
PASS: virnetmessagetest
PASS: virnetsockettest
PASS: virnetdaemontest
PASS: virnetserverclienttest
FAIL: virnettlssessiontest
PASS: fchosttest
PASS: scsihosttest
PASS: virnettlscontexttest
PASS: vircaps2xmltest
PASS: fdstreamtest
PASS: virdbustest
PASS: virsystemdtest
PASS: virpolkittest
PASS: securityselinuxtest
PASS: viridentitytest
PASS: securityselinuxlabeltest
PASS: xml2sexprtest
PASS: sexpr2xmltest
PASS: xmconfigtest
PASS: xencapstest
PASS: xlconfigtest
PASS: libxlxml2domconfigtest
PASS: qemuxml2xmltest
PASS: qemuxml2argvtest
PASS: qemuhelptest
PASS: qemuargv2xmltest
PASS: qemumonitortest
PASS: domainsnapshotxml2xmltest
PASS: qemumonitorjsontest
PASS: qemuhotplugtest
PASS: qemucapabilitiestest
PASS: qemucaps2xmltest
PASS: qemumemlocktest
PASS: qemucommandutiltest
PASS: lxcxml2xmltest
PASS: lxcconf2xmltest
PASS: openvzutilstest
PASS: esxutilstest
PASS: qemuagenttest
PASS: vboxsnapshotxmltest
PASS: vmx2xmltest
PASS: xml2vmxtest
PASS: vmwarevertest
PASS: virjsontest
PASS: networkxml2xmltest
PASS: networkxml2xmlupdatetest
PASS: networkxml2conftest
PASS: networkxml2firewalltest
PASS: storagebackendsheepdogtest
PASS: nwfilterebiptablestest
PASS: nwfilterxml2xmltest
PASS: nwfilterxml2firewalltest
PASS: storagevolxml2argvtest
PASS: virstorageutiltest
PASS: virscsitest
PASS: nsstest
PASS: virstoragetest
PASS: nssguesttest
PASS: storagevolxml2xmltest
PASS: storagepoolxml2xmltest
PASS: nodedevxml2xmltest
PASS: interfacexml2xmltest
PASS: metadatatest
PASS: cputest
PASS: secretxml2xmltest
PASS: genericxml2xmltest
PASS: virusbtest
PASS: virnetdevbandwidthtest
PASS: virdrivermoduletest
PASS: eventtest
PASS: objecteventtest
PASS: virmacmaptest
PASS: libvirtd-pool
PASS: libvirtd-fail
PASS: virsh-cpuset
PASS: virsh-define-dev-segfault
PASS: virsh-int-overflow
PASS: virsh-read-bufsiz
PASS: virsh-read-non-seekable
PASS: virsh-schedinfo
PASS: virsh-self-test
PASS: virt-admin-self-test
PASS: virsh-start
PASS: virsh-undefine
PASS: virsh-uriprecedence
PASS: virsh-vcpupin
PASS: virsh-optparse
============================================================================
Testsuite summary for libvirt 3.7.0
============================================================================
# TOTAL: 127
# PASS:  126
# SKIP:  0
# XFAIL: 0
# FAIL:  1
# XPASS: 0
# ERROR: 0
============================================================================
See tests/test-suite.log
Please report to libvir-list redhat com
============================================================================
make[2]: *** [Makefile:5988: test-suite.log] Error 1
make[2]: Leaving directory '<https://ci.centos.org/job/libvirt-master-rpm/systems=libvirt-fedora-rawhide/ws/build/rpmbuild/BUILD/libvirt-3.7.0/tests'>
make[1]: *** [Makefile:6096: check-TESTS] Error 2
make[1]: Leaving directory '<https://ci.centos.org/job/libvirt-master-rpm/systems=libvirt-fedora-rawhide/ws/build/rpmbuild/BUILD/libvirt-3.7.0/tests'>
make: *** [Makefile:7084: check-am] Error 2
+ cat test-suite.log
=========================================
   libvirt 3.7.0: tests/test-suite.log
=========================================

# TOTAL: 127
# PASS:  126
# SKIP:  0
# XFAIL: 0
# FAIL:  1
# XPASS: 0
# ERROR: 0

.. contents:: :depth: 2

FAIL: virnettlssessiontest
==========================

TEST: virnettlssessiontest
 1) TLS Session servercertreq.filename + clientcertreq.filename       ... libvirt: XML-RPC error : Failed to set TLS session priority to @LIBVIRT,SYSTEM: The request is invalid.
FAILED
 2) TLS Session servercertreq.filename + clientcertaltreq.filename    ... libvirt: XML-RPC error : Failed to set TLS session priority to @LIBVIRT,SYSTEM: The request is invalid.
FAILED
 3) TLS Session servercertalt1req.filename + clientcertreq.filename   ... libvirt: XML-RPC error : Failed to set TLS session priority to @LIBVIRT,SYSTEM: The request is invalid.
FAILED
 4) TLS Session servercertalt1req.filename + clientcertreq.filename   ... libvirt: XML-RPC error : Failed to set TLS session priority to @LIBVIRT,SYSTEM: The request is invalid.
FAILED
 5) TLS Session servercertalt1req.filename + clientcertreq.filename   ... libvirt: XML-RPC error : Failed to set TLS session priority to @LIBVIRT,SYSTEM: The request is invalid.
FAILED
 6) TLS Session servercertalt2req.filename + clientcertreq.filename   ... libvirt: XML-RPC error : Failed to set TLS session priority to @LIBVIRT,SYSTEM: The request is invalid.
FAILED
 7) TLS Session servercertalt2req.filename + clientcertreq.filename   ... libvirt: XML-RPC error : Failed to set TLS session priority to @LIBVIRT,SYSTEM: The request is invalid.
FAILED
 8) TLS Session servercertalt2req.filename + clientcertreq.filename   ... libvirt: XML-RPC error : Failed to set TLS session priority to @LIBVIRT,SYSTEM: The request is invalid.
FAILED
 9) TLS Session servercertreq.filename + clientcertreq.filename       ... libvirt: XML-RPC error : Failed to set TLS session priority to @LIBVIRT,SYSTEM: The request is invalid.
FAILED
10) TLS Session servercertreq.filename + clientcertreq.filename       ... libvirt: XML-RPC error : Failed to set TLS session priority to @LIBVIRT,SYSTEM: The request is invalid.
FAILED
11) TLS Session servercertreq.filename + clientcertreq.filename       ... libvirt: XML-RPC error : Failed to set TLS session priority to @LIBVIRT,SYSTEM: The request is invalid.
FAILED
12) TLS Session servercertreq.filename + clientcertreq.filename       ... libvirt: XML-RPC error : Failed to set TLS session priority to @LIBVIRT,SYSTEM: The request is invalid.
FAILED
13) TLS Session servercertreq.filename + clientcertreq.filename       ... libvirt: XML-RPC error : Failed to set TLS session priority to @LIBVIRT,SYSTEM: The request is invalid.
FAILED
14) TLS Session servercertreq.filename + clientcertreq.filename       ... libvirt: XML-RPC error : Failed to set TLS session priority to @LIBVIRT,SYSTEM: The request is invalid.
FAILED
15) TLS Session servercertlevel3areq.filename + clientcertlevel2breq.filename ... libvirt: XML-RPC error : Failed to set TLS session priority to @LIBVIRT,SYSTEM: The request is invalid.
FAILED
FAIL virnettlssessiontest (exit status: 1)

+ exit 1
error: Bad exit status from /var/tmp/rpm-tmp.pjROyu (%check)


RPM build errors:
    Bad exit status from /var/tmp/rpm-tmp.pjROyu (%check)
Build step 'Execute shell' marked build as failure


[Date Prev][Date Next]   [Thread Prev][Thread Next]   [Thread Index] [Date Index] [Author Index]