[Date Prev][Date Next]   [Thread Prev][Thread Next]   [Thread Index] [Date Index] [Author Index]

[Libvirt-ci] Build failed in Jenkins: libvirt-master- check » libvirt-fedora-rawhide #586



See <https://ci.centos.org/job/libvirt-master-check/systems=libvirt-fedora-rawhide/586/display/redirect>

------------------------------------------
[...truncated 17.81 KB...]
make[4]: 'test-strings' is up to date.
make[4]: 'test-strnlen' is up to date.
make[4]: 'test-symlink' is up to date.
make[4]: 'test-sys_ioctl' is up to date.
make[4]: 'test-sys_select' is up to date.
make[4]: 'test-sys_socket' is up to date.
make[4]: 'test-sys_stat' is up to date.
make[4]: 'test-sys_time' is up to date.
make[4]: 'test-sys_types' is up to date.
make[4]: 'test-sys_uio' is up to date.
make[4]: 'test-sys_utsname' is up to date.
make[4]: 'test-sys_wait' is up to date.
make[4]: 'test-termios' is up to date.
make[4]: 'test-thread_self' is up to date.
make[4]: 'test-thread_create' is up to date.
make[4]: 'test-time' is up to date.
make[4]: 'test-ttyname_r' is up to date.
make[4]: 'test-uname' is up to date.
make[4]: 'test-unistd' is up to date.
make[4]: 'test-unlockpt' is up to date.
make[4]: 'test-unsetenv' is up to date.
make[4]: 'test-usleep' is up to date.
make[4]: 'test-vasnprintf' is up to date.
make[4]: 'test-vasprintf' is up to date.
make[4]: 'test-verify' is up to date.
make[4]: 'test-vsnprintf' is up to date.
make[4]: 'test-wchar' is up to date.
make[4]: 'test-wcrtomb' is up to date.
make[4]: 'test-wcrtomb-w32' is up to date.
make[4]: 'test-wctype-h' is up to date.
make[4]: 'test-write' is up to date.
make[4]: 'test-xalloc-die' is up to date.
make[4]: Leaving directory '<https://ci.centos.org/job/libvirt-master-check/systems=libvirt-fedora-rawhide/ws/build/gnulib/tests'>
make  check-TESTS
make[4]: Entering directory '<https://ci.centos.org/job/libvirt-master-check/systems=libvirt-fedora-rawhide/ws/build/gnulib/tests'>
make[5]: Entering directory '<https://ci.centos.org/job/libvirt-master-check/systems=libvirt-fedora-rawhide/ws/build/gnulib/tests'>
============================================================================
Testsuite summary for libvirt 3.7.0
============================================================================
# TOTAL: 0
# PASS:  0
# SKIP:  0
# XFAIL: 0
# FAIL:  0
# XPASS: 0
# ERROR: 0
============================================================================
make[5]: Leaving directory '<https://ci.centos.org/job/libvirt-master-check/systems=libvirt-fedora-rawhide/ws/build/gnulib/tests'>
make[4]: Leaving directory '<https://ci.centos.org/job/libvirt-master-check/systems=libvirt-fedora-rawhide/ws/build/gnulib/tests'>
make[3]: Leaving directory '<https://ci.centos.org/job/libvirt-master-check/systems=libvirt-fedora-rawhide/ws/build/gnulib/tests'>
make[2]: Leaving directory '<https://ci.centos.org/job/libvirt-master-check/systems=libvirt-fedora-rawhide/ws/build/gnulib/tests'>
make[1]: Leaving directory '<https://ci.centos.org/job/libvirt-master-check/systems=libvirt-fedora-rawhide/ws/build/gnulib/tests'>
Making check in tests
make[1]: Entering directory '<https://ci.centos.org/job/libvirt-master-check/systems=libvirt-fedora-rawhide/ws/build/tests'>
make   
make[2]: Entering directory '<https://ci.centos.org/job/libvirt-master-check/systems=libvirt-fedora-rawhide/ws/build/tests'>
make[2]: Nothing to be done for 'all'.
make[2]: Leaving directory '<https://ci.centos.org/job/libvirt-master-check/systems=libvirt-fedora-rawhide/ws/build/tests'>
make  check-TESTS
make[2]: Entering directory '<https://ci.centos.org/job/libvirt-master-check/systems=libvirt-fedora-rawhide/ws/build/tests'>
make[3]: Entering directory '<https://ci.centos.org/job/libvirt-master-check/systems=libvirt-fedora-rawhide/ws/build/tests'>
PASS: sockettest
PASS: virhostcputest
PASS: virbuftest
PASS: seclabeltest
PASS: virhashtest
PASS: virconftest
PASS: viratomictest
PASS: commandtest
PASS: shunloadtest
PASS: utiltest
PASS: virtimetest
PASS: viruritest
PASS: virkeyfiletest
PASS: viralloctest
PASS: virauthconfigtest
PASS: virbitmaptest
PASS: vircryptotest
PASS: vircgrouptest
PASS: virpcitest
PASS: virendiantest
PASS: virfilecachetest
PASS: virfiletest
PASS: virfirewalltest
PASS: viriscsitest
PASS: virkeycodetest
PASS: virlockspacetest
PASS: virlogtest
PASS: virrotatingfiletest
PASS: virstringtest
PASS: virportallocatortest
PASS: sysinfotest
PASS: virkmodtest
PASS: vircapstest
PASS: domaincapstest
PASS: domainconftest
PASS: virhostdevtest
PASS: virnetdevtest
PASS: virtypedparamtest
PASS: virnetmessagetest
PASS: virschematest
PASS: virnetsockettest
PASS: virnetserverclienttest
PASS: virnetdaemontest
FAIL: virnettlscontexttest
PASS: fchosttest
PASS: scsihosttest
PASS: vircaps2xmltest
PASS: fdstreamtest
PASS: virdbustest
FAIL: virnettlssessiontest
PASS: virsystemdtest
PASS: virpolkittest
PASS: securityselinuxtest
PASS: viridentitytest
PASS: securityselinuxlabeltest
PASS: xml2sexprtest
PASS: sexpr2xmltest
PASS: virshtest
PASS: xmconfigtest
PASS: xencapstest
PASS: xlconfigtest
PASS: libxlxml2domconfigtest
PASS: qemuargv2xmltest
PASS: qemuhelptest
PASS: domainsnapshotxml2xmltest
PASS: qemumonitortest
PASS: qemuxml2argvtest
PASS: qemuxml2xmltest
PASS: qemumonitorjsontest
PASS: qemuagenttest
PASS: qemucaps2xmltest
PASS: qemumemlocktest
PASS: qemucommandutiltest
PASS: lxcxml2xmltest
PASS: lxcconf2xmltest
PASS: openvzutilstest
PASS: qemucapabilitiestest
PASS: qemuhotplugtest
PASS: esxutilstest
PASS: vboxsnapshotxmltest
PASS: vmx2xmltest
PASS: xml2vmxtest
PASS: vmwarevertest
PASS: virjsontest
PASS: networkxml2xmlupdatetest
PASS: networkxml2xmltest
PASS: networkxml2conftest
PASS: networkxml2firewalltest
PASS: storagebackendsheepdogtest
PASS: nwfilterxml2xmltest
PASS: nwfilterebiptablestest
PASS: nwfilterxml2firewalltest
PASS: storagevolxml2argvtest
PASS: virstorageutiltest
PASS: virscsitest
PASS: nsstest
PASS: nssguesttest
PASS: storagevolxml2xmltest
PASS: storagepoolxml2xmltest
PASS: nodedevxml2xmltest
PASS: interfacexml2xmltest
PASS: metadatatest
PASS: secretxml2xmltest
PASS: genericxml2xmltest
PASS: cputest
PASS: virusbtest
PASS: virstoragetest
PASS: virnetdevbandwidthtest
PASS: objecteventtest
PASS: virdrivermoduletest
PASS: virmacmaptest
PASS: libvirtd-pool
PASS: eventtest
PASS: libvirtd-fail
PASS: virsh-int-overflow
PASS: virsh-define-dev-segfault
SKIP: virsh-optparse
PASS: virsh-cpuset
PASS: virsh-schedinfo
PASS: virsh-read-non-seekable
PASS: virsh-read-bufsiz
PASS: virsh-self-test
PASS: virt-admin-self-test
PASS: virsh-start
PASS: virsh-undefine
PASS: virsh-uriprecedence
PASS: virsh-vcpupin
============================================================================
Testsuite summary for libvirt 3.7.0
============================================================================
# TOTAL: 127
# PASS:  124
# SKIP:  1
# XFAIL: 0
# FAIL:  2
# XPASS: 0
# ERROR: 0
============================================================================
See tests/test-suite.log
Please report to libvir-list redhat com
============================================================================
make[3]: *** [Makefile:5988: test-suite.log] Error 1
make[3]: Leaving directory '<https://ci.centos.org/job/libvirt-master-check/systems=libvirt-fedora-rawhide/ws/build/tests'>
make[2]: *** [Makefile:6096: check-TESTS] Error 2
make[2]: Leaving directory '<https://ci.centos.org/job/libvirt-master-check/systems=libvirt-fedora-rawhide/ws/build/tests'>
make[1]: *** [Makefile:7084: check-am] Error 2
make[1]: Leaving directory '<https://ci.centos.org/job/libvirt-master-check/systems=libvirt-fedora-rawhide/ws/build/tests'>
make: *** [Makefile:2114: check-recursive] Error 1
+ cat tests/test-suite.log
=========================================
   libvirt 3.7.0: tests/test-suite.log
=========================================

# TOTAL: 127
# PASS:  124
# SKIP:  1
# XFAIL: 0
# FAIL:  2
# XPASS: 0
# ERROR: 0

.. contents:: :depth: 2

FAIL: virnettlscontexttest
==========================

TEST: virnettlscontexttest
      !!!!!...!!!!!!!...!!!!!!!.........!!.    37  FAIL
FAIL virnettlscontexttest (exit status: 1)

FAIL: virnettlssessiontest
==========================

TEST: virnettlssessiontest
      !.!!!!!!!!!!!!!                          15  FAIL
FAIL virnettlssessiontest (exit status: 1)

SKIP: virsh-optparse
====================

../../tests/virsh-optparse: skipping test: 
This test is very expensive, so it is disabled by default.
To run it anyway, rerun: make check VIR_TEST_EXPENSIVE=1

SKIP virsh-optparse (exit status: 77)

+ exit 1
Build step 'Execute shell' marked build as failure


[Date Prev][Date Next]   [Thread Prev][Thread Next]   [Thread Index] [Date Index] [Author Index]