[Date Prev][Date Next]   [Thread Prev][Thread Next]   [Thread Index] [Date Index] [Author Index]

[Libvirt-ci] Build failed in Jenkins: libvirt-master- check » libvirt-centos-7 #588



See <https://ci.centos.org/job/libvirt-master-check/systems=libvirt-centos-7/588/display/redirect>

------------------------------------------
[...truncated 22.87 KB...]
  CCLD     test-strchrnul
  CCLD     test-strerror
  CCLD     test-strerror_r
  CCLD     test-string
  CCLD     test-strings
  CCLD     test-strnlen
  CCLD     test-symlink
  CCLD     test-sys_ioctl
  CCLD     test-sys_select
  CCLD     test-sys_socket
  CCLD     test-sys_stat
  CCLD     test-sys_time
  CCLD     test-sys_types
  CCLD     test-sys_uio
  CCLD     test-sys_utsname
  CCLD     test-sys_wait
  CCLD     test-termios
  CCLD     test-thread_self
  CCLD     test-thread_create
  CCLD     test-time
  CCLD     test-ttyname_r
  CCLD     test-uname
  CCLD     test-unistd
  CCLD     test-unlockpt
  CCLD     test-unsetenv
  CCLD     test-usleep
  CCLD     test-vasnprintf
  CCLD     test-vasprintf
  CCLD     test-verify
  CCLD     test-vsnprintf
  CCLD     test-wchar
  CCLD     test-wcrtomb
  CCLD     test-wcrtomb-w32
  CCLD     test-wctype-h
  CCLD     test-write
  CCLD     test-xalloc-die
make[4]: Leaving directory `<https://ci.centos.org/job/libvirt-master-check/systems=libvirt-centos-7/ws/build/gnulib/tests'>
make  check-TESTS
make[4]: Entering directory `<https://ci.centos.org/job/libvirt-master-check/systems=libvirt-centos-7/ws/build/gnulib/tests'>
make[5]: Entering directory `<https://ci.centos.org/job/libvirt-master-check/systems=libvirt-centos-7/ws/build/gnulib/tests'>
make[6]: Entering directory `<https://ci.centos.org/job/libvirt-master-check/systems=libvirt-centos-7/ws/build/gnulib/tests'>
make  all-recursive
make[7]: Entering directory `<https://ci.centos.org/job/libvirt-master-check/systems=libvirt-centos-7/ws/build/gnulib/tests'>
Making all in .
make[8]: Entering directory `<https://ci.centos.org/job/libvirt-master-check/systems=libvirt-centos-7/ws/build/gnulib/tests'>
make[8]: Nothing to be done for `all-am'.
make[8]: Leaving directory `<https://ci.centos.org/job/libvirt-master-check/systems=libvirt-centos-7/ws/build/gnulib/tests'>
make[7]: Leaving directory `<https://ci.centos.org/job/libvirt-master-check/systems=libvirt-centos-7/ws/build/gnulib/tests'>
make[6]: Leaving directory `<https://ci.centos.org/job/libvirt-master-check/systems=libvirt-centos-7/ws/build/gnulib/tests'>
============================================================================
Testsuite summary for libvirt 3.7.0
============================================================================
# TOTAL: 0
# PASS:  0
# SKIP:  0
# XFAIL: 0
# FAIL:  0
# XPASS: 0
# ERROR: 0
============================================================================
make[5]: Leaving directory `<https://ci.centos.org/job/libvirt-master-check/systems=libvirt-centos-7/ws/build/gnulib/tests'>
make[4]: Leaving directory `<https://ci.centos.org/job/libvirt-master-check/systems=libvirt-centos-7/ws/build/gnulib/tests'>
make[3]: Leaving directory `<https://ci.centos.org/job/libvirt-master-check/systems=libvirt-centos-7/ws/build/gnulib/tests'>
make[2]: Leaving directory `<https://ci.centos.org/job/libvirt-master-check/systems=libvirt-centos-7/ws/build/gnulib/tests'>
make[1]: Leaving directory `<https://ci.centos.org/job/libvirt-master-check/systems=libvirt-centos-7/ws/build/gnulib/tests'>
Making check in tests
make[1]: Entering directory `<https://ci.centos.org/job/libvirt-master-check/systems=libvirt-centos-7/ws/build/tests'>
make   
make[2]: Entering directory `<https://ci.centos.org/job/libvirt-master-check/systems=libvirt-centos-7/ws/build/tests'>
make[2]: Nothing to be done for `all'.
make[2]: Leaving directory `<https://ci.centos.org/job/libvirt-master-check/systems=libvirt-centos-7/ws/build/tests'>
make  check-TESTS
make[2]: Entering directory `<https://ci.centos.org/job/libvirt-master-check/systems=libvirt-centos-7/ws/build/tests'>
make[3]: Entering directory `<https://ci.centos.org/job/libvirt-master-check/systems=libvirt-centos-7/ws/build/tests'>
PASS: virhostcputest
PASS: sockettest
PASS: virbuftest
PASS: seclabeltest
PASS: commandtest
PASS: virhashtest
PASS: virconftest
PASS: viratomictest
PASS: utiltest
PASS: shunloadtest
PASS: viruritest
PASS: virtimetest
PASS: viralloctest
PASS: virkeyfiletest
PASS: virauthconfigtest
PASS: virbitmaptest
PASS: vircgrouptest
PASS: vircryptotest
PASS: virpcitest
PASS: virendiantest
PASS: virfiletest
PASS: virfilecachetest
PASS: virfirewalltest
PASS: viriscsitest
PASS: virkeycodetest
PASS: virlockspacetest
PASS: virlogtest
PASS: virrotatingfiletest
PASS: virstringtest
PASS: virshtest
PASS: virportallocatortest
PASS: sysinfotest
PASS: virkmodtest
PASS: vircapstest
PASS: virschematest
PASS: domaincapstest
PASS: domainconftest
PASS: virhostdevtest
PASS: virnetdevtest
PASS: virtypedparamtest
PASS: virnetmessagetest
FAIL: virnetsockettest
PASS: virnetserverclienttest
PASS: virnetdaemontest
PASS: fchosttest
PASS: virnettlscontexttest
PASS: virnettlssessiontest
PASS: scsihosttest
PASS: vircaps2xmltest
PASS: fdstreamtest
PASS: virsystemdtest
PASS: virdbustest
PASS: virpolkittest
PASS: viridentitytest
PASS: securityselinuxtest
PASS: securityselinuxlabeltest
PASS: qemuxml2argvtest
PASS: qemuargv2xmltest
PASS: qemuhelptest
PASS: qemuxml2xmltest
PASS: domainsnapshotxml2xmltest
PASS: qemumonitortest
PASS: qemuagenttest
PASS: qemumonitorjsontest
PASS: qemuhotplugtest
PASS: qemucaps2xmltest
PASS: qemucapabilitiestest
PASS: qemumemlocktest
PASS: qemucommandutiltest
PASS: lxcxml2xmltest
PASS: lxcconf2xmltest
PASS: openvzutilstest
PASS: esxutilstest
PASS: vmx2xmltest
PASS: vboxsnapshotxmltest
PASS: xml2vmxtest
PASS: vmwarevertest
PASS: virjsontest
PASS: networkxml2xmltest
PASS: networkxml2xmlupdatetest
PASS: networkxml2conftest
PASS: networkxml2firewalltest
PASS: nwfilterxml2xmltest
PASS: nwfilterebiptablestest
PASS: nwfilterxml2firewalltest
PASS: storagevolxml2argvtest
PASS: virstorageutiltest
PASS: virscsitest
PASS: nsstest
PASS: nssguesttest
PASS: storagevolxml2xmltest
PASS: storagepoolxml2xmltest
PASS: nodedevxml2xmltest
PASS: interfacexml2xmltest
PASS: metadatatest
PASS: virstoragetest
PASS: cputest
PASS: genericxml2xmltest
PASS: secretxml2xmltest
PASS: virnetdevbandwidthtest
PASS: virusbtest
PASS: eventtest
PASS: virdrivermoduletest
PASS: objecteventtest
PASS: virmacmaptest
PASS: libvirtd-pool
PASS: libvirtd-fail
PASS: virsh-define-dev-segfault
PASS: virsh-cpuset
SKIP: virsh-optparse
PASS: virsh-int-overflow
PASS: virsh-schedinfo
PASS: virsh-read-non-seekable
PASS: virsh-read-bufsiz
PASS: virsh-self-test
PASS: virsh-start
PASS: virsh-undefine
PASS: virt-admin-self-test
PASS: virsh-uriprecedence
PASS: virsh-vcpupin
make[4]: Entering directory `<https://ci.centos.org/job/libvirt-master-check/systems=libvirt-centos-7/ws/build/tests'>
make[4]: Nothing to be done for `all'.
make[4]: Leaving directory `<https://ci.centos.org/job/libvirt-master-check/systems=libvirt-centos-7/ws/build/tests'>
============================================================================
Testsuite summary for libvirt 3.7.0
============================================================================
# TOTAL: 120
# PASS:  118
# SKIP:  1
# XFAIL: 0
# FAIL:  1
# XPASS: 0
# ERROR: 0
============================================================================
See tests/test-suite.log
Please report to libvir-list redhat com
============================================================================
make[3]: *** [test-suite.log] Error 1
make[3]: Leaving directory `<https://ci.centos.org/job/libvirt-master-check/systems=libvirt-centos-7/ws/build/tests'>
make[2]: *** [check-TESTS] Error 2
make[2]: Leaving directory `<https://ci.centos.org/job/libvirt-master-check/systems=libvirt-centos-7/ws/build/tests'>
make[1]: *** [check-am] Error 2
make[1]: Leaving directory `<https://ci.centos.org/job/libvirt-master-check/systems=libvirt-centos-7/ws/build/tests'>
make: *** [check-recursive] Error 1
+ cat tests/test-suite.log
=========================================
   libvirt 3.7.0: tests/test-suite.log
=========================================

# TOTAL: 120
# PASS:  118
# SKIP:  1
# XFAIL: 0
# FAIL:  1
# XPASS: 0
# ERROR: 0

.. contents:: :depth: 2

FAIL: virnetsockettest
======================

TEST: virnetsockettest
      ........!!!.!!!                          15  FAIL

SKIP: virsh-optparse
====================

../../tests/virsh-optparse: skipping test: 
This test is very expensive, so it is disabled by default.
To run it anyway, rerun: make check VIR_TEST_EXPENSIVE=1


+ exit 1
Build step 'Execute shell' marked build as failure


[Date Prev][Date Next]   [Thread Prev][Thread Next]   [Thread Index] [Date Index] [Author Index]