[Date Prev][Date Next]   [Thread Prev][Thread Next]   [Thread Index] [Date Index] [Author Index]

[Libvirt-ci] Build failed in Jenkins: libvirt-master- build » libvirt-fedora-rawhide #593



See <https://ci.centos.org/job/libvirt-master-build/systems=libvirt-fedora-rawhide/593/display/redirect?page=changes>

Changes:

[pkrempa] qemu: Don't error out if allocation info can't be queried

------------------------------------------
[...truncated 174.59 KB...]
  CC       qemucpumock_la-qemucpumock.lo
  CC       nssmock_la-nssmock.lo
  CC       virmacmapmock_la-virmacmapmock.lo
  CC       securityselinuxhelper.lo
  CC       virshtest.o
  CC       testutils.o
  CC       sockettest.o
  CC       virhostcputest.o
  CC       virfilewrapper.o
  CC       virbuftest.o
  CC       commandtest.o
  CC       seclabeltest.o
  CC       virhashtest.o
  CC       virconftest.o
  CC       viratomictest.o
  CC       utiltest.o
  CC       shunloadtest.o
  CC       virtimetest.o
  CC       viruritest.o
  CC       virkeyfiletest.o
  CC       viralloctest.o
  CC       virauthconfigtest.o
  CC       virbitmaptest.o
  CC       vircgrouptest.o
  CC       vircryptotest.o
  CC       virpcitest.o
  CC       virendiantest.o
  CC       virfiletest.o
  CC       virfirewalltest-virfirewalltest.o
  CC       virfirewalltest-testutils.o
  CC       viriscsitest.o
  CC       virkeycodetest.o
  CC       virlockspacetest.o
  CC       virlogtest.o
  CC       virrotatingfiletest-virrotatingfiletest.o
  CC       virrotatingfiletest-testutils.o
  CC       virschematest.o
  CC       virstringtest.o
  CC       virportallocatortest.o
  CC       sysinfotest.o
  CC       virkmodtest.o
  CC       vircapstest.o
  CC       testutilslxc.o
  CC       testutilsqemu.o
  CC       testutilsxen.o
  CC       domaincapstest.o
  CC       domainconftest.o
  CC       virhostdevtest.o
  CC       virnetdevtest-virnetdevtest.o
  CC       virnetdevtest-testutils.o
  CC       virtypedparamtest.o
  CC       virnetmessagetest-virnetmessagetest.o
  CC       virnetmessagetest-testutils.o
  CC       virnetsockettest.o
  CC       virnetdaemontest-virnetdaemontest.o
  CC       virnetdaemontest-testutils.o
  CC       virnetserverclienttest-virnetserverclienttest.o
  CC       virnetserverclienttest-testutils.o
  CC       virnettlscontexttest.o
  CC       virnettlshelpers.o
  CC       pkix_asn1_tab.o
  CC       virnettlssessiontest.o
  CC       fchosttest.o
  CC       scsihosttest.o
  CC       vircaps2xmltest.o
  CC       fdstreamtest.o
  CC       virdbustest-virdbustest.o
  CC       virdbustest-testutils.o
  CC       virsystemdtest-virsystemdtest.o
  CC       virsystemdtest-testutils.o
  CC       virpolkittest-virpolkittest.o
  CC       virpolkittest-testutils.o
  CC       securityselinuxtest.o
  CC       viridentitytest.o
  CC       securityselinuxlabeltest.o
  CC       virdrivermoduletest.o
  CC       xml2sexprtest.o
  CC       sexpr2xmltest.o
  CC       xmconfigtest.o
  CC       xencapstest.o
  CC       xlconfigtest.o
  CC       qemuxml2argvtest.o
  CC       qemuxml2xmltest.o
  CC       qemuargv2xmltest.o
  CC       qemuhelptest.o
  CC       domainsnapshotxml2xmltest.o
  CC       qemumonitortest.o
  CC       qemumonitorjsontest.o
  CC       qemuhotplugtest.o
  CC       qemuagenttest.o
  CC       qemucapabilitiestest.o
  CC       qemucaps2xmltest.o
  CC       qemumemlocktest.o
  CC       qemucommandutiltest.o
  CC       lxcxml2xmltest.o
  CC       lxcconf2xmltest.o
  CC       openvzutilstest.o
  CC       esxutilstest.o
  CC       vboxsnapshotxmltest.o
  CC       vmx2xmltest.o
  CC       xml2vmxtest.o
  CC       vmwarevertest.o
  CC       jsontest.o
  CC       networkxml2xmltest.o
  CC       networkxml2xmlupdatetest.o
  CC       networkxml2conftest.o
  CC       networkxml2firewalltest.o
  CC       storagebackendsheepdogtest.o
  CC       nwfilterxml2xmltest.o
  CC       nwfilterebiptablestest.o
  CC       nwfilterxml2firewalltest.o
  CC       storagevolxml2argvtest.o
  CC       virstorageutiltest.o
  CC       virstoragetest.o
  CC       virscsitest.o
  CC       nsstest-nsstest.o
  CC       nsstest-testutils.o
  CC       nssguesttest-nsstest.o
  CC       nssguesttest-testutils.o
  CC       storagevolxml2xmltest.o
  CC       storagepoolxml2xmltest.o
  CC       nodedevxml2xmltest.o
  CC       interfacexml2xmltest.o
  CC       cputest.o
  CC       metadatatest.o
  CC       secretxml2xmltest.o
  CC       genericxml2xmltest.o
  CC       virusbtest.o
  CC       virnetdevbandwidthtest.o
  CC       eventtest.o
  CC       objecteventtest.o
  CC       virmacmaptest.o
  CC       commandhelper.o
  CC       ssh.o
  CC       qemucapsprobe.o
  CC       nsslinktest-nsslinktest.o
  CC       nssguestlinktest-nsslinktest.o
  CCLD     libshunload.la
  CCLD     virportallocatormock.la
  CCLD     virnetdaemonmock.la
  CCLD     virnetserverclientmock.la
  CCLD     vircgroupmock.la
  CCLD     virpcimock.la
  CCLD     virnetdevmock.la
  CCLD     virrandommock.la
  CCLD     virhostcpumock.la
  CCLD     domaincapsmock.la
  CCLD     virusbmock.la
  CCLD     virnetdevbandwidthmock.la
  CCLD     virnumamock.la
  CCLD     virtestmock.la
  CCLD     virdbusmock.la
  CCLD     libqemumonitortestutils.la
  CCLD     qemuxml2argvmock.la
  CCLD     qemuxml2xmlmock.la
  CCLD     qemucaps2xmlmock.la
  CCLD     qemucapsprobemock.la
  CCLD     qemucpumock.la
  CCLD     nssmock.la
  CCLD     virmacmapmock.la
  CCLD     libsecurityselinuxhelper.la
  CCLD     virshtest
  CCLD     sockettest
  CCLD     virhostcputest
  CCLD     virbuftest
  CCLD     commandtest
  CCLD     seclabeltest
  CCLD     virhashtest
  CCLD     virconftest
  CCLD     viratomictest
  CCLD     utiltest
  CCLD     shunloadtest
  CCLD     virtimetest
  CCLD     viruritest
  CCLD     virkeyfiletest
  CCLD     viralloctest
  CCLD     virauthconfigtest
  CCLD     virbitmaptest
  CCLD     vircgrouptest
  CCLD     vircryptotest
  CCLD     virpcitest
  CCLD     virendiantest
  CCLD     virfiletest
  CCLD     virfirewalltest
  CCLD     viriscsitest
  CCLD     virkeycodetest
  CCLD     virlockspacetest
  CCLD     virlogtest
  CCLD     virrotatingfiletest
  CCLD     virschematest
  CCLD     virstringtest
  CCLD     virportallocatortest
  CCLD     sysinfotest
  CCLD     virkmodtest
  CCLD     vircapstest
  CCLD     domaincapstest
  CCLD     domainconftest
  CCLD     virhostdevtest
  CCLD     virnetdevtest
  CCLD     virtypedparamtest
  CCLD     virnetmessagetest
  CCLD     virnetsockettest
  CCLD     virnetdaemontest
  CCLD     virnetserverclienttest
  CCLD     virnettlscontexttest
  CCLD     virnettlssessiontest
  CCLD     fchosttest
  CCLD     scsihosttest
  CCLD     vircaps2xmltest
  CCLD     fdstreamtest
  CCLD     virdbustest
  CCLD     virsystemdtest
  CCLD     virpolkittest
  CCLD     securityselinuxtest
  CCLD     viridentitytest
  CCLD     securityselinuxlabeltest
  CCLD     virdrivermoduletest
  CCLD     xml2sexprtest
  CCLD     sexpr2xmltest
  CCLD     xmconfigtest
  CCLD     xencapstest
  CCLD     xlconfigtest
  CCLD     qemuxml2argvtest
  CCLD     qemuxml2xmltest
  CCLD     qemuargv2xmltest
  CCLD     qemuhelptest
  CCLD     domainsnapshotxml2xmltest
  CCLD     qemumonitortest
  CCLD     qemumonitorjsontest
  CCLD     qemuhotplugtest
  CCLD     qemuagenttest
  CCLD     qemucapabilitiestest
  CCLD     qemucaps2xmltest
  CCLD     qemumemlocktest
/usr/bin/ld: final link failed: No space left on device
collect2: error: ld returned 1 exit status
make[2]: *** [Makefile:4835: qemucaps2xmltest] Error 1
make[2]: *** Waiting for unfinished jobs....
/usr/bin/ld: final link failed: No space left on device
collect2: error: ld returned 1 exit status
make[2]: *** [Makefile:4831: qemucapabilitiestest] Error 1
/usr/bin/ld: final link failed: No space left on device
collect2: error: ld returned 1 exit status
make[2]: *** [Makefile:4855: qemumemlocktest] Error 1
make[2]: Leaving directory '<https://ci.centos.org/job/libvirt-master-build/systems=libvirt-fedora-rawhide/ws/build/tests'>
make[1]: *** [Makefile:2109: all-recursive] Error 1
make[1]: Leaving directory '<https://ci.centos.org/job/libvirt-master-build/systems=libvirt-fedora-rawhide/ws/build'>
make: *** [Makefile:2002: all] Error 2
Build step 'Execute shell' marked build as failure


[Date Prev][Date Next]   [Thread Prev][Thread Next]   [Thread Index] [Date Index] [Author Index]