[Date Prev][Date Next]   [Thread Prev][Thread Next]   [Thread Index] [Date Index] [Author Index]

[Libvirt-ci] Build failed in Jenkins: libvirt-master- build » libvirt-freebsd #598



See <https://ci.centos.org/job/libvirt-master-build/systems=libvirt-freebsd/598/display/redirect?page=changes>

Changes:

[mkletzan] Expose resource control capabilities for caches

[mkletzan] Reset the whole stack in testutils

------------------------------------------
[...truncated 538.69 KB...]
missing XHTML1 DTD
missing XHTML1 DTD
missing XHTML1 DTD
missing XHTML1 DTD
missing XHTML1 DTD
missing XHTML1 DTD
missing XHTML1 DTD
missing XHTML1 DTD
missing XHTML1 DTD
missing XHTML1 DTD
missing XHTML1 DTD
missing XHTML1 DTD
missing XHTML1 DTD
missing XHTML1 DTD
missing XHTML1 DTD
missing XHTML1 DTD
missing XHTML1 DTD
missing XHTML1 DTD
missing XHTML1 DTD
missing XHTML1 DTD
missing XHTML1 DTD
missing XHTML1 DTD
missing XHTML1 DTD
missing XHTML1 DTD
missing XHTML1 DTD
missing XHTML1 DTD
missing XHTML1 DTD
missing XHTML1 DTD
missing XHTML1 DTD
missing XHTML1 DTD
missing XHTML1 DTD
missing XHTML1 DTD
missing XHTML1 DTD
missing XHTML1 DTD
missing XHTML1 DTD
missing XHTML1 DTD
missing XHTML1 DTD
missing XHTML1 DTD
missing XHTML1 DTD
missing XHTML1 DTD
missing XHTML1 DTD
missing XHTML1 DTD
missing XHTML1 DTD
missing XHTML1 DTD
missing XHTML1 DTD
missing XHTML1 DTD
missing XHTML1 DTD
missing XHTML1 DTD
missing XHTML1 DTD
missing XHTML1 DTD
missing XHTML1 DTD
missing XHTML1 DTD
missing XHTML1 DTD
missing XHTML1 DTD
missing XHTML1 DTD
missing XHTML1 DTD
missing XHTML1 DTD
missing XHTML1 DTD
missing XHTML1 DTD
missing XHTML1 DTD
missing XHTML1 DTD
missing XHTML1 DTD
missing XHTML1 DTD
missing XHTML1 DTD
missing XHTML1 DTD
missing XHTML1 DTD
missing XHTML1 DTD
missing XHTML1 DTD
missing XHTML1 DTD
missing XHTML1 DTD
missing XHTML1 DTD
missing XHTML1 DTD
missing XHTML1 DTD
missing XHTML1 DTD
missing XHTML1 DTD
missing XHTML1 DTD
missing XHTML1 DTD
missing XHTML1 DTD
missing XHTML1 DTD
missing XHTML1 DTD
missing XHTML1 DTD
missing XHTML1 DTD
missing XHTML1 DTD
missing XHTML1 DTD
missing XHTML1 DTD
missing XHTML1 DTD
missing XHTML1 DTD
missing XHTML1 DTD
missing XHTML1 DTD
missing XHTML1 DTD
Scripting search.php
missing XHTML1 DTD
touch ../../docs/apibuild.py.stamp
  GEN      ../../docs/hvsupport.html.in
  GEN      html/index.html
  GEN      ../../docs/devhelp/index.html
Generating hvsupport.html.tmp
I/O error : Attempt to load network entity http://www.w3.org/TR/xhtml1/DTD/xhtml1-strict.dtd
../../docs/hvsupport.html.in:2: warning: failed to load external entity "http://www.w3.org/TR/xhtml1/DTD/xhtml1-strict.dtd";
C//DTD XHTML 1.0 Strict//EN" "http://www.w3.org/TR/xhtml1/DTD/xhtml1-strict.dtd";
                                                                               ^
missing XHTML1 DTD
missing XHTML1 DTD
rm internals/rpc.html.tmp drvopenvz.html.tmp logging.html.tmp aclpolkit.html.tmp windows.html.tmp formatnwfilter.html.tmp php.html.tmp formatnetwork.html.tmp locking.html.tmp formatstorageencryption.html.tmp drvhyperv.html.tmp testapi.html.tmp format.html.tmp errors.html.tmp formatdomaincaps.html.tmp hacking.html.tmp news-2008.html.tmp news-2006.html.tmp formatcaps.html.tmp internals.html.tmp auditlog.html.tmp downloads.html.tmp internals/oomtesting.html.tmp bugs.html.tmp drvphyp.html.tmp java.html.tmp drvesx.html.tmp contribute.html.tmp migration.html.tmp news-2009.html.tmp locking-lockd.html.tmp devguide.html.tmp drvqemu.html.tmp drvvmware.html.tmp architecture.html.tmp drvvirtuozzo.html.tmp search.php.tmp formatsnapshot.html.tmp acl.html.tmp news-2005.html.tmp drvxen.html.tmp securityprocess.html.tmp 404.html.tmp api_extension.html.tmp drvuml.html.tmp news-2015.html.tmp formatstorage.html.tmp drvremote.html.tmp hooks.html.tmp internals/locking.html.tmp python.html.tmp remote.html.tmp drivers.html.tmp formatsecret.html.tmp news-2014.html.tmp news.html.tmp formatnode.html.tmp internals/eventloop.html.tmp goals.html.tmp apps.html.tmp formatdomain.html.tmp internals/command.html.tmp drvvbox.html.tmp csharp.html.tmp secureusage.html.tmp governance.html.tmp cgroups.html.tmp news-2013.html.tmp news-2007.html.tmp bindings.html.tmp api.html.tmp news-2016.html.tmp news-2010.html.tmp contact.html.tmp news-2011.html.tmp index.html.tmp drvlxc.html.tmp uri.html.tmp hvsupport.html.tmp news-2012.html.tmp locking-sanlock.html.tmp drvtest.html.tmp drvnodedev.html.tmp testtck.html.tmp docs.html.tmp drvbhyve.html.tmp testsuites.html.tmp nss.html.tmp storage.html.tmp firewall.html.tmp virshcmdref.html.tmp compiling.html.tmp auth.html.tmp
gmake[2]: Leaving directory '/usr<https://ci.centos.org/job/libvirt-master-build/systems=libvirt-freebsd/ws/build/docs'>
Making all in gnulib/tests
gmake[2]: Entering directory '/usr<https://ci.centos.org/job/libvirt-master-build/systems=libvirt-freebsd/ws/build/gnulib/tests'>
  GEN      ctype.h
  GEN      inttypes.h
  GEN      math.h
  GEN      test-posix_spawn1.sh
  GEN      test-posix_spawn2.sh
  GEN      spawn.h
gmake  all-recursive
gmake[3]: Entering directory '/usr<https://ci.centos.org/job/libvirt-master-build/systems=libvirt-freebsd/ws/build/gnulib/tests'>
Making all in .
gmake[4]: Entering directory '/usr<https://ci.centos.org/job/libvirt-master-build/systems=libvirt-freebsd/ws/build/gnulib/tests'>
gmake[4]: Nothing to be done for 'all-am'.
gmake[4]: Leaving directory '/usr<https://ci.centos.org/job/libvirt-master-build/systems=libvirt-freebsd/ws/build/gnulib/tests'>
gmake[3]: Leaving directory '/usr<https://ci.centos.org/job/libvirt-master-build/systems=libvirt-freebsd/ws/build/gnulib/tests'>
gmake[2]: Leaving directory '/usr<https://ci.centos.org/job/libvirt-master-build/systems=libvirt-freebsd/ws/build/gnulib/tests'>
Making all in tests
gmake[2]: Entering directory '/usr<https://ci.centos.org/job/libvirt-master-build/systems=libvirt-freebsd/ws/build/tests'>
  CC       shunloadhelper.lo
  CC       virportallocatormock_la-virportallocatormock.lo
  CC       virnetdaemonmock_la-virnetdaemonmock.lo
  CC       virnetserverclientmock_la-virnetserverclientmock.lo
  CC       vircgroupmock_la-vircgroupmock.lo
  CC       virpcimock_la-virpcimock.lo
  CC       virnetdevmock_la-virnetdevmock.lo
  CC       virrandommock_la-virrandommock.lo
  CC       virhostcpumock_la-virhostcpumock.lo
  CC       domaincapsmock_la-domaincapsmock.lo
  CC       virdbusmock_la-virdbusmock.lo
  CC       qemumonitortestutils.lo
  CCLD     libqemutestdriver.la
  CC       qemuxml2argvmock_la-qemuxml2argvmock.lo
  CC       qemuxml2xmlmock_la-qemuxml2xmlmock.lo
  CC       qemucaps2xmlmock_la-qemucaps2xmlmock.lo
  CC       qemucapsprobemock_la-qemucapsprobemock.lo
  CC       qemucpumock_la-qemucpumock.lo
  CC       bhyvexml2argvmock_la-bhyvexml2argvmock.lo
  CC       bhyveargv2xmlmock_la-bhyveargv2xmlmock.lo
  CC       nssmock_la-nssmock.lo
  CC       virmacmapmock_la-virmacmapmock.lo
  CC       virshtest.o
  CC       testutils.o
  CC       sockettest.o
  CC       virhostcputest.o
  CC       virfilewrapper.o
  CC       virbuftest.o
  CC       commandtest.o
  CC       seclabeltest.o
  CC       virhashtest.o
  CC       virconftest.o
  CC       viratomictest.o
  CC       utiltest.o
  CC       shunloadtest.o
  CC       virtimetest.o
  CC       viruritest.o
  CC       virkeyfiletest.o
  CC       viralloctest.o
  CC       virauthconfigtest.o
  CC       virbitmaptest.o
  CC       vircgrouptest.o
  CC       vircryptotest.o
  CC       virpcitest.o
  CC       virendiantest.o
  CC       virfiletest.o
  CC       virfirewalltest-virfirewalltest.o
  CC       virfirewalltest-testutils.o
  CC       viriscsitest.o
  CC       virkeycodetest.o
  CC       virlockspacetest.o
  CC       virlogtest.o
  CC       virrotatingfiletest-virrotatingfiletest.o
  CC       virrotatingfiletest-testutils.o
  CC       virschematest.o
  CC       virstringtest.o
  CC       sysinfotest.o
  CC       virportallocatortest.o
  CC       virkmodtest.o
  CC       vircapstest.o
  CC       testutilsqemu.o
  CC       domaincapstest.o
  CC       domainconftest.o
  CC       virhostdevtest.o
  CC       virnetdevtest-virnetdevtest.o
  CC       virnetdevtest-testutils.o
  CC       virtypedparamtest.o
  CC       virnetmessagetest-virnetmessagetest.o
  CC       virnetmessagetest-testutils.o
  CC       virnetsockettest.o
  CC       virnetdaemontest-virnetdaemontest.o
  CC       virnetdaemontest-testutils.o
  CC       virnetserverclienttest-virnetserverclienttest.o
  CC       virnetserverclienttest-testutils.o
  CC       virnettlscontexttest.o
  CC       virnettlshelpers.o
  CC       virnettlssessiontest.o
  CC       fdstreamtest.o
  CC       virdbustest-virdbustest.o
  CC       virdbustest-testutils.o
  CC       virsystemdtest-virsystemdtest.o
  CC       virsystemdtest-testutils.o
  CC       virdrivermoduletest.o
  CC       qemuxml2argvtest.o
  CC       qemuxml2xmltest.o
  CC       qemuargv2xmltest.o
  CC       qemuhelptest.o
  CC       domainsnapshotxml2xmltest.o
  CC       qemumonitortest.o
  CC       qemumonitorjsontest.o
  CC       qemuhotplugtest.o
  CC       qemuagenttest.o
  CC       qemucapabilitiestest.o
  CC       qemucaps2xmltest.o
  CC       qemumemlocktest.o
  CC       qemucommandutiltest.o
  CC       esxutilstest.o
  CC       vboxsnapshotxmltest.o
  CC       vmx2xmltest.o
  CC       xml2vmxtest.o
  CC       vmwarevertest.o
  CC       bhyvexml2argvtest.o
  CC       bhyvexml2xmltest.o
  CC       bhyveargv2xmltest.o
  CC       jsontest.o
  CC       networkxml2xmltest.o
../../tests/bhyveargv2xmltest.c:77:61: error: too few arguments to function call, expected 3, have 2
    if (vmdef && !virDomainDefCheckABIStability(vmdef, vmdef)) {
                  ~~~~~~~~~~~~~~~~~~~~~~~~~~~~~             ^
../../src/conf/domain_conf.h:2818:1: note: 'virDomainDefCheckABIStability' declared here
bool virDomainDefCheckABIStability(virDomainDefPtr src,
^
/usr/include/stdbool.h:37:14: note: expanded from macro 'bool'
#define bool    _Bool
                ^
1 error generated.
Makefile:5331: recipe for target 'bhyveargv2xmltest.o' failed
gmake[2]: *** [bhyveargv2xmltest.o] Error 1
gmake[2]: *** Waiting for unfinished jobs....
gmake[2]: Leaving directory '/usr<https://ci.centos.org/job/libvirt-master-build/systems=libvirt-freebsd/ws/build/tests'>
Makefile:2109: recipe for target 'all-recursive' failed
gmake[1]: *** [all-recursive] Error 1
gmake[1]: Leaving directory '/usr<https://ci.centos.org/job/libvirt-master-build/systems=libvirt-freebsd/ws/build'>
Makefile:2002: recipe for target 'all' failed
gmake: *** [all] Error 2
Build step 'Execute shell' marked build as failure


[Date Prev][Date Next]   [Thread Prev][Thread Next]   [Thread Index] [Date Index] [Author Index]