[Date Prev][Date Next]   [Thread Prev][Thread Next]   [Thread Index] [Date Index] [Author Index]

[Libvirt-ci] Build failed in Jenkins: libvirt-master- mingw » libvirt-fedora-rawhide #1191



See <https://ci.centos.org/job/libvirt-master-mingw/systems=libvirt-fedora-rawhide/1191/display/redirect?page=changes>

Changes:

[jdenemar] qemu: Introduce qemuDomainDefFromXML helper

[jdenemar] qemu: Add qemuDomainMigratableDefCheckABIStability

[jdenemar] qemu: Add qemuDomainCheckABIStability

[jdenemar] qemu: Use qemuDomainCheckABIStability where needed

------------------------------------------
Started by upstream project "libvirt-master-mingw" build number 1191
originally caused by:
 Started by an SCM change
[EnvInject] - Loading node environment variables.
Building remotely on libvirt-fedora-rawhide (libvirt) in workspace /home/jenkins/libvirt-master-mingw
 > git rev-parse --is-inside-work-tree # timeout=10
Fetching changes from the remote Git repository
 > git config remote.origin.url git://n64.pufty.ci.centos.org/libvirt.git # timeout=10
Fetching upstream changes from git://n64.pufty.ci.centos.org/libvirt.git
 > git --version # timeout=10
 > git fetch --tags --progress git://n64.pufty.ci.centos.org/libvirt.git +refs/heads/*:refs/remotes/origin/*
Checking out Revision f0a3fe1b0a2996272dd167501bb5de752d9d1956 (refs/remotes/origin/master)
 > git config core.sparsecheckout # timeout=10
 > git checkout -f f0a3fe1b0a2996272dd167501bb5de752d9d1956
 > git rev-list 1e8d6c6ef07a33ab338c2bf38fa017d4f2123335 # timeout=10
Cleaning workspace
 > git rev-parse --verify HEAD # timeout=10
Resetting working tree
 > git reset --hard # timeout=10
 > git clean -fdx # timeout=10
[libvirt-master-mingw] $ /bin/sh -xe /tmp/hudson3333965302023682087.sh
+ mkdir -p build32
+ cd build32
+ export PKG_CONFIG_LIBDIR=/usr/i686-w64-mingw32/sys-root/mingw/lib/pkgconfig:/usr/i686-w64-mingw32/sys-root/mingw/share/pkgconfig
+ PKG_CONFIG_LIBDIR=/usr/i686-w64-mingw32/sys-root/mingw/lib/pkgconfig:/usr/i686-w64-mingw32/sys-root/mingw/share/pkgconfig
+ export PKG_CONFIG_PATH=/home/jenkins/build/libvirt/i686-w64-mingw32/sys-root/mingw/lib/pkgconfig export PREFIX=/home/jenkins/build/libvirt/i686-w64-mingw32/sys-root/mingw
+ PKG_CONFIG_PATH=/home/jenkins/build/libvirt/i686-w64-mingw32/sys-root/mingw/lib/pkgconfig
+ PREFIX=/home/jenkins/build/libvirt/i686-w64-mingw32/sys-root/mingw
+ ../autogen.sh --host=i686-w64-mingw32 --prefix=/home/jenkins/build/libvirt/i686-w64-mingw32/sys-root/mingw
Updating submodules...
Running bootstrap...
./bootstrap: Bootstrapping from checked-out libvirt sources...
./bootstrap: consider installing git-merge-changelog from gnulib
./bootstrap: getting gnulib files...
./bootstrap: autopoint --force
Copying file ABOUT-NLS
Copying file build-aux/config.rpath
Copying file m4/codeset.m4
Copying file m4/gettext.m4
Copying file m4/glibc2.m4
Copying file m4/glibc21.m4
Copying file m4/iconv.m4
Copying file m4/intdiv0.m4
Copying file m4/intl.m4
Copying file m4/intldir.m4
Copying file m4/intlmacosx.m4
Copying file m4/intmax.m4
Copying file m4/inttypes-pri.m4
Copying file m4/inttypes_h.m4
Copying file m4/lcmessage.m4
Copying file m4/lib-ld.m4
Copying file m4/lib-link.m4
Copying file m4/lib-prefix.m4
Copying file m4/lock.m4
Copying file m4/longlong.m4
Copying file m4/nls.m4
Copying file m4/po.m4
Copying file m4/printf-posix.m4
Copying file m4/progtest.m4
Copying file m4/size_max.m4
Copying file m4/stdint_h.m4
Copying file m4/uintmax_t.m4
Copying file m4/visibility.m4
Copying file m4/wchar_t.m4
Copying file m4/wint_t.m4
Copying file m4/xsize.m4
Copying file po/Makefile.in.in
Copying file po/Makevars.template
Copying file po/Rules-quot
Copying file po/boldquot.sed
Copying file po/en boldquot header
Copying file po/en quot header
Copying file po/insert-header.sin
Copying file po/quot.sed
Copying file po/remove-potcdate.sin
running: libtoolize --install --copy
libtoolize: putting auxiliary files in AC_CONFIG_AUX_DIR, 'build-aux'.
libtoolize: copying file 'build-aux/config.guess'
libtoolize: copying file 'build-aux/config.sub'
libtoolize: copying file 'build-aux/install-sh'
libtoolize: copying file 'build-aux/ltmain.sh'
libtoolize: putting macros in AC_CONFIG_MACRO_DIRS, 'm4'.
libtoolize: copying file 'm4/libtool.m4'
libtoolize: copying file 'm4/ltoptions.m4'
libtoolize: copying file 'm4/ltsugar.m4'
libtoolize: copying file 'm4/ltversion.m4'
libtoolize: copying file 'm4/lt~obsolete.m4'
./bootstrap: .gnulib/gnulib-tool  --import --no-changelog --aux-dir build-aux --doc-base doc --lib libgnu --m4-base m4/ --source-base gnulib/lib/ --tests-base gnulib/tests --local-dir gnulib/local  --lgpl=2 --with-tests --makefile-name=gnulib.mk --avoid=pt_chown --avoid=lock-tests --libtool --import ...
FATAL: command execution failed
java.lang.OutOfMemoryError: unable to create new native thread
	at java.lang.Thread.start0(Native Method)
	at java.lang.Thread.start(Thread.java:714)
	at java.util.concurrent.ThreadPoolExecutor.addWorker(ThreadPoolExecutor.java:949)
	at java.util.concurrent.ThreadPoolExecutor.execute(ThreadPoolExecutor.java:1371)
	at java.util.concurrent.AbstractExecutorService.submit(AbstractExecutorService.java:112)
	at com.google.common.util.concurrent.ForwardingExecutorService.submit(ForwardingExecutorService.java:110)
	at jenkins.util.InterceptingExecutorService.submit(InterceptingExecutorService.java:49)
	at hudson.remoting.SingleLaneExecutorService.execute(SingleLaneExecutorService.java:105)
	at java.util.concurrent.AbstractExecutorService.submit(AbstractExecutorService.java:112)
	at org.jenkinsci.remoting.nio.NioChannelHub.run(NioChannelHub.java:595)
Caused: java.io.IOException: Connection aborted: org jenkinsci remoting nio NioChannelHub$MonoNioTransport 30c89d88[name=Channel to /172.19.1.11]
	at org.jenkinsci.remoting.nio.NioChannelHub$NioTransport.abort(NioChannelHub.java:210)
	at org.jenkinsci.remoting.nio.NioChannelHub.abortAll(NioChannelHub.java:686)
	at org.jenkinsci.remoting.nio.NioChannelHub.run(NioChannelHub.java:663)
	at jenkins.util.ContextResettingExecutorService$1.run(ContextResettingExecutorService.java:28)
	at java.util.concurrent.Executors$RunnableAdapter.call(Executors.java:473)
	at java.util.concurrent.FutureTask.run(FutureTask.java:262)
	at java.util.concurrent.ThreadPoolExecutor.runWorker(ThreadPoolExecutor.java:1145)
	at java.util.concurrent.ThreadPoolExecutor$Worker.run(ThreadPoolExecutor.java:615)
	at java.lang.Thread.run(Thread.java:745)
Caused: java.io.IOException: Backing channel 'Channel to /172.19.1.11' is disconnected.
	at hudson.remoting.RemoteInvocationHandler.channelOrFail(RemoteInvocationHandler.java:192)
	at hudson.remoting.RemoteInvocationHandler.invoke(RemoteInvocationHandler.java:257)
	at com.sun.proxy.$Proxy83.isAlive(Unknown Source)
	at hudson.Launcher$RemoteLauncher$ProcImpl.isAlive(Launcher.java:1043)
	at hudson.Launcher$RemoteLauncher$ProcImpl.join(Launcher.java:1035)
	at hudson.tasks.CommandInterpreter.join(CommandInterpreter.java:155)
	at hudson.tasks.CommandInterpreter.perform(CommandInterpreter.java:109)
	at hudson.tasks.CommandInterpreter.perform(CommandInterpreter.java:66)
	at hudson.tasks.BuildStepMonitor$1.perform(BuildStepMonitor.java:20)
	at hudson.model.AbstractBuild$AbstractBuildExecution.perform(AbstractBuild.java:779)
	at hudson.model.Build$BuildExecution.build(Build.java:206)
	at hudson.model.Build$BuildExecution.doRun(Build.java:163)
	at hudson.model.AbstractBuild$AbstractBuildExecution.run(AbstractBuild.java:534)
	at hudson.model.Run.execute(Run.java:1728)
	at hudson.matrix.MatrixRun.run(MatrixRun.java:146)
	at hudson.model.ResourceController.execute(ResourceController.java:98)
	at hudson.model.Executor.run(Executor.java:405)
Build step 'Execute shell' marked build as failure
FATAL: channel is already closed
java.lang.OutOfMemoryError: unable to create new native thread
	at java.lang.Thread.start0(Native Method)
	at java.lang.Thread.start(Thread.java:714)
	at java.util.concurrent.ThreadPoolExecutor.addWorker(ThreadPoolExecutor.java:949)
	at java.util.concurrent.ThreadPoolExecutor.execute(ThreadPoolExecutor.java:1371)
	at java.util.concurrent.AbstractExecutorService.submit(AbstractExecutorService.java:112)
	at com.google.common.util.concurrent.ForwardingExecutorService.submit(ForwardingExecutorService.java:110)
	at jenkins.util.InterceptingExecutorService.submit(InterceptingExecutorService.java:49)
	at hudson.remoting.SingleLaneExecutorService.execute(SingleLaneExecutorService.java:105)
	at java.util.concurrent.AbstractExecutorService.submit(AbstractExecutorService.java:112)
	at org.jenkinsci.remoting.nio.NioChannelHub.run(NioChannelHub.java:595)
Caused: java.io.IOException: Connection aborted: org jenkinsci remoting nio NioChannelHub$MonoNioTransport 30c89d88[name=Channel to /172.19.1.11]
	at org.jenkinsci.remoting.nio.NioChannelHub$NioTransport.abort(NioChannelHub.java:210)
	at org.jenkinsci.remoting.nio.NioChannelHub.abortAll(NioChannelHub.java:686)
	at org.jenkinsci.remoting.nio.NioChannelHub.run(NioChannelHub.java:663)
	at jenkins.util.ContextResettingExecutorService$1.run(ContextResettingExecutorService.java:28)
	at java.util.concurrent.Executors$RunnableAdapter.call(Executors.java:473)
	at java.util.concurrent.FutureTask.run(FutureTask.java:262)
	at java.util.concurrent.ThreadPoolExecutor.runWorker(ThreadPoolExecutor.java:1145)
	at java.util.concurrent.ThreadPoolExecutor$Worker.run(ThreadPoolExecutor.java:615)
	at java.lang.Thread.run(Thread.java:745)
Caused: hudson.remoting.ChannelClosedException: channel is already closed
	at hudson.remoting.Channel.send(Channel.java:605)
	at hudson.remoting.Request.call(Request.java:130)
	at hudson.remoting.Channel.call(Channel.java:829)
	at hudson.Launcher$RemoteLauncher.kill(Launcher.java:984)
	at hudson.model.AbstractBuild$AbstractBuildExecution.run(AbstractBuild.java:540)
	at hudson.model.Run.execute(Run.java:1728)
	at hudson.matrix.MatrixRun.run(MatrixRun.java:146)
	at hudson.model.ResourceController.execute(ResourceController.java:98)
	at hudson.model.Executor.run(Executor.java:405)


[Date Prev][Date Next]   [Thread Prev][Thread Next]   [Thread Index] [Date Index] [Author Index]