[Date Prev][Date Next]   [Thread Prev][Thread Next]   [Thread Index] [Date Index] [Author Index]

[Libvirt-ci] Build failed in Jenkins: libvirt-master- check » libvirt-fedora-rawhide #436



See <https://ci.centos.org/job/libvirt-master-check/systems=libvirt-fedora-rawhide/436/display/redirect>

------------------------------------------
Started by upstream project "libvirt-master-check" build number 436
originally caused by:
 Started by upstream project "libvirt-master-syntax-check" build number 437
 originally caused by:
  Started by user Libvirt
[EnvInject] - Loading node environment variables.
Building remotely on libvirt-fedora-rawhide (libvirt) in workspace <https://ci.centos.org/job/libvirt-master-check/systems=libvirt-fedora-rawhide/ws/>
[libvirt-master] $ /bin/sh -xe /tmp/hudson6074445974412697631.sh
+ MAKE=make
++ uname
+ unamestr=Linux
+ '[' Linux = FreeBSD ']'
+ cd build
+ make -j3 check
  GEN      public-submodule-commit
Making check in .
make[1]: Entering directory '<https://ci.centos.org/job/libvirt-master-check/systems=libvirt-fedora-rawhide/ws/build'>
make  check-local
make[2]: Entering directory '<https://ci.centos.org/job/libvirt-master-check/systems=libvirt-fedora-rawhide/ws/build'>
make  all-recursive
make[3]: Entering directory '<https://ci.centos.org/job/libvirt-master-check/systems=libvirt-fedora-rawhide/ws/build'>
Making all in .
make[4]: Entering directory '<https://ci.centos.org/job/libvirt-master-check/systems=libvirt-fedora-rawhide/ws/build'>
make[4]: Leaving directory '<https://ci.centos.org/job/libvirt-master-check/systems=libvirt-fedora-rawhide/ws/build'>
Making all in gnulib/lib
make[4]: Entering directory '<https://ci.centos.org/job/libvirt-master-check/systems=libvirt-fedora-rawhide/ws/build/gnulib/lib'>
make  all-am
make[5]: Entering directory '<https://ci.centos.org/job/libvirt-master-check/systems=libvirt-fedora-rawhide/ws/build/gnulib/lib'>
make[5]: Nothing to be done for 'all-am'.
make[5]: Leaving directory '<https://ci.centos.org/job/libvirt-master-check/systems=libvirt-fedora-rawhide/ws/build/gnulib/lib'>
make[4]: Leaving directory '<https://ci.centos.org/job/libvirt-master-check/systems=libvirt-fedora-rawhide/ws/build/gnulib/lib'>
Making all in include/libvirt
make[4]: Entering directory '<https://ci.centos.org/job/libvirt-master-check/systems=libvirt-fedora-rawhide/ws/build/include/libvirt'>
make[4]: Nothing to be done for 'all'.
make[4]: Leaving directory '<https://ci.centos.org/job/libvirt-master-check/systems=libvirt-fedora-rawhide/ws/build/include/libvirt'>
Making all in src
make[4]: Entering directory '<https://ci.centos.org/job/libvirt-master-check/systems=libvirt-fedora-rawhide/ws/build/src'>
make  all-am
make[5]: Entering directory '<https://ci.centos.org/job/libvirt-master-check/systems=libvirt-fedora-rawhide/ws/build/src'>
  CC       util/libvirt_util_la-viralloc.lo
  CC       util/libvirt_util_la-virarch.lo
  CC       util/libvirt_util_la-viratomic.lo
  CC       util/libvirt_util_la-viraudit.lo
  CC       util/libvirt_util_la-virauth.lo
  CC       util/libvirt_util_la-virauthconfig.lo
  CC       util/libvirt_util_la-virbitmap.lo
  CC       util/libvirt_util_la-virbuffer.lo
  CC       util/libvirt_util_la-virperf.lo
  CC       util/libvirt_util_la-vircgroup.lo
  CC       util/libvirt_util_la-virclosecallbacks.lo
  CC       util/libvirt_util_la-vircommand.lo
  CC       util/libvirt_util_la-virconf.lo
  CC       util/libvirt_util_la-vircrypto.lo
  CC       util/libvirt_util_la-virdbus.lo
  CC       util/libvirt_util_la-virdnsmasq.lo
  CC       util/libvirt_util_la-virebtables.lo
  CC       util/libvirt_util_la-virerror.lo
  CC       util/libvirt_util_la-virevent.lo
  CC       util/libvirt_util_la-vireventpoll.lo
  CC       util/libvirt_util_la-virfcp.lo
  CC       util/libvirt_util_la-virfdstream.lo
  CC       util/libvirt_util_la-virfile.lo
  CC       util/libvirt_util_la-virfirewall.lo
  CC       util/libvirt_util_la-virfirmware.lo
  CC       util/libvirt_util_la-virgettext.lo
  CC       util/libvirt_util_la-virgic.lo
  CC       util/libvirt_util_la-virhash.lo
  CC       util/libvirt_util_la-virhashcode.lo
  CC       util/libvirt_util_la-virhook.lo
  CC       util/libvirt_util_la-virhostcpu.lo
  CC       util/libvirt_util_la-virhostdev.lo
  CC       util/libvirt_util_la-virhostmem.lo
  CC       util/libvirt_util_la-viridentity.lo
  CC       util/libvirt_util_la-virinitctl.lo
  CC       util/libvirt_util_la-viriptables.lo
  CC       util/libvirt_util_la-viriscsi.lo
  CC       util/libvirt_util_la-virjson.lo
  CC       util/libvirt_util_la-virkeycode.lo
  CC       util/libvirt_util_la-virkeyfile.lo
  CC       util/libvirt_util_la-virlease.lo
  CC       util/libvirt_util_la-virlockspace.lo
  CC       util/libvirt_util_la-virlog.lo
  CC       util/libvirt_util_la-virmacaddr.lo
  CC       util/libvirt_util_la-virmacmap.lo
  CC       util/libvirt_util_la-virnetdev.lo
  CC       util/libvirt_util_la-virnetdevbandwidth.lo
  CC       util/libvirt_util_la-virnetdevbridge.lo
  CC       util/libvirt_util_la-virnetdevip.lo
  CC       util/libvirt_util_la-virnetdevmacvlan.lo
  CC       util/libvirt_util_la-virnetdevmidonet.lo
  CC       util/libvirt_util_la-virnetdevopenvswitch.lo
  CC       util/libvirt_util_la-virnetdevtap.lo
  CC       util/libvirt_util_la-virnetdevveth.lo
  CC       util/libvirt_util_la-virnetdevvlan.lo
  CC       util/libvirt_util_la-virnetdevvportprofile.lo
  CC       util/libvirt_util_la-virnetlink.lo
  CC       util/libvirt_util_la-virnodesuspend.lo
  CC       util/libvirt_util_la-virkmod.lo
  CC       util/libvirt_util_la-virnuma.lo
  CC       util/libvirt_util_la-virobject.lo
  CC       util/libvirt_util_la-virpci.lo
  CC       util/libvirt_util_la-virpidfile.lo
  CC       util/libvirt_util_la-virpolkit.lo
  CC       util/libvirt_util_la-virportallocator.lo
  CC       util/libvirt_util_la-virprocess.lo
../../src/util/virpci.c: In function 'virPCIDeviceNew':
../../src/util/virpci.c:1772:9: error: '%.2x' directive output may be truncated writing between 2 and 8 bytes into a region of size between 4 and 8 [-Werror=format-truncation=]
     if (snprintf(dev->name, sizeof(dev->name), "%.4x:%.2x:%.2x.%.1x",
         ^~~~~~~~~~~~~~~~~~~~~~~~~~~~~~~~~~~~~~~~~~~~~~~~~~~~~~~~~~~~~
                  domain, bus, slot, function) >= sizeof(dev->name)) {
                  ~~~~~~~~~~~~~~~~~~~~~~~~~~~~
In file included from /usr/include/stdio.h:889:0,
                 from ../gnulib/lib/stdio.h:43,
                 from ../../src/util/virpci.c:32:
/usr/include/bits/stdio2.h:64:10: note: '__builtin___snprintf_chk' output between 13 and 36 bytes into a destination of size 13
   return __builtin___snprintf_chk (__s, __n, __USE_FORTIFY_LEVEL - 1,
          ^~~~~~~~~~~~~~~~~~~~~~~~~~~~~~~~~~~~~~~~~~~~~~~~~~~~~~~~~~~~
        __bos (__s), __fmt, __va_arg_pack ());
        ~~~~~~~~~~~~~~~~~~~~~~~~~~~~~~~~~~~~~
cc1: all warnings being treated as errors
make[5]: *** [Makefile:10695: util/libvirt_util_la-virpci.lo] Error 1
make[5]: *** Waiting for unfinished jobs....
make[5]: Leaving directory '<https://ci.centos.org/job/libvirt-master-check/systems=libvirt-fedora-rawhide/ws/build/src'>
make[4]: *** [Makefile:5941: all] Error 2
make[4]: Leaving directory '<https://ci.centos.org/job/libvirt-master-check/systems=libvirt-fedora-rawhide/ws/build/src'>
make[3]: *** [Makefile:2109: all-recursive] Error 1
make[3]: Leaving directory '<https://ci.centos.org/job/libvirt-master-check/systems=libvirt-fedora-rawhide/ws/build'>
make[2]: *** [Makefile:2002: all] Error 2
make[2]: Leaving directory '<https://ci.centos.org/job/libvirt-master-check/systems=libvirt-fedora-rawhide/ws/build'>
make[1]: *** [Makefile:2399: check-am] Error 2
make[1]: Leaving directory '<https://ci.centos.org/job/libvirt-master-check/systems=libvirt-fedora-rawhide/ws/build'>
make: *** [Makefile:2109: check-recursive] Error 1
+ cat tests/test-suite.log
cat: tests/test-suite.log: No such file or directory
+ true
+ exit 1
Build step 'Execute shell' marked build as failure


[Date Prev][Date Next]   [Thread Prev][Thread Next]   [Thread Index] [Date Index] [Author Index]