[Date Prev][Date Next]   [Thread Prev][Thread Next]   [Thread Index] [Date Index] [Author Index]

[Libvirt-ci] Build failed in Jenkins: libvirt-master- check » libvirt-fedora-24 #439



See <https://ci.centos.org/job/libvirt-master-check/systems=libvirt-fedora-24/439/display/redirect>

------------------------------------------
[...truncated 22.99 KB...]
  CCLD     test-stdlib
  CCLD     test-strchrnul
  CCLD     test-strerror
  CCLD     test-string
  CCLD     test-strerror_r
  CCLD     test-strings
  CCLD     test-strnlen
  CCLD     test-symlink
  CCLD     test-sys_ioctl
  CCLD     test-sys_select
  CCLD     test-sys_socket
  CCLD     test-sys_stat
  CCLD     test-sys_time
  CCLD     test-sys_types
  CCLD     test-sys_uio
  CCLD     test-sys_utsname
  CCLD     test-sys_wait
  CCLD     test-termios
  CCLD     test-thread_self
  CCLD     test-thread_create
  CCLD     test-ttyname_r
  CCLD     test-time
  CCLD     test-uname
  CCLD     test-unistd
  CCLD     test-unlockpt
  CCLD     test-unsetenv
  CCLD     test-usleep
  CCLD     test-vasnprintf
  CCLD     test-vasprintf
  CCLD     test-verify
  CCLD     test-vsnprintf
  CCLD     test-wchar
  CCLD     test-wcrtomb
  CCLD     test-wcrtomb-w32
  CCLD     test-wctype-h
  CCLD     test-write
  CCLD     test-xalloc-die
make[4]: Leaving directory '<https://ci.centos.org/job/libvirt-master-check/systems=libvirt-fedora-24/ws/build/gnulib/tests'>
make  check-TESTS
make[4]: Entering directory '<https://ci.centos.org/job/libvirt-master-check/systems=libvirt-fedora-24/ws/build/gnulib/tests'>
make[5]: Entering directory '<https://ci.centos.org/job/libvirt-master-check/systems=libvirt-fedora-24/ws/build/gnulib/tests'>
============================================================================
Testsuite summary for libvirt 3.5.0
============================================================================
# TOTAL: 0
# PASS:  0
# SKIP:  0
# XFAIL: 0
# FAIL:  0
# XPASS: 0
# ERROR: 0
============================================================================
make[5]: Leaving directory '<https://ci.centos.org/job/libvirt-master-check/systems=libvirt-fedora-24/ws/build/gnulib/tests'>
make[4]: Leaving directory '<https://ci.centos.org/job/libvirt-master-check/systems=libvirt-fedora-24/ws/build/gnulib/tests'>
make[3]: Leaving directory '<https://ci.centos.org/job/libvirt-master-check/systems=libvirt-fedora-24/ws/build/gnulib/tests'>
make[2]: Leaving directory '<https://ci.centos.org/job/libvirt-master-check/systems=libvirt-fedora-24/ws/build/gnulib/tests'>
make[1]: Leaving directory '<https://ci.centos.org/job/libvirt-master-check/systems=libvirt-fedora-24/ws/build/gnulib/tests'>
Making check in tests
make[1]: Entering directory '<https://ci.centos.org/job/libvirt-master-check/systems=libvirt-fedora-24/ws/build/tests'>
make   
make[2]: Entering directory '<https://ci.centos.org/job/libvirt-master-check/systems=libvirt-fedora-24/ws/build/tests'>
make[2]: Nothing to be done for 'all'.
make[2]: Leaving directory '<https://ci.centos.org/job/libvirt-master-check/systems=libvirt-fedora-24/ws/build/tests'>
make  check-TESTS
make[2]: Entering directory '<https://ci.centos.org/job/libvirt-master-check/systems=libvirt-fedora-24/ws/build/tests'>
make[3]: Entering directory '<https://ci.centos.org/job/libvirt-master-check/systems=libvirt-fedora-24/ws/build/tests'>
PASS: sockettest
PASS: virhostcputest
PASS: virbuftest
PASS: seclabeltest
PASS: virhashtest
PASS: commandtest
PASS: virconftest
PASS: viratomictest
PASS: shunloadtest
PASS: utiltest
PASS: virtimetest
PASS: viruritest
PASS: virkeyfiletest
PASS: viralloctest
PASS: virauthconfigtest
PASS: virbitmaptest
PASS: vircgrouptest
PASS: vircryptotest
PASS: virendiantest
PASS: virpcitest
PASS: virfirewalltest
PASS: virfiletest
PASS: viriscsitest
PASS: virkeycodetest
PASS: virlockspacetest
PASS: virlogtest
PASS: virrotatingfiletest
PASS: virshtest
PASS: virstringtest
PASS: virportallocatortest
PASS: sysinfotest
PASS: virkmodtest
PASS: vircapstest
PASS: virschematest
PASS: domaincapstest
PASS: domainconftest
PASS: virnetdevtest
PASS: virhostdevtest
PASS: virtypedparamtest
PASS: virnetmessagetest
FAIL: virnetsockettest
PASS: virnetdaemontest
PASS: virnetserverclienttest
PASS: fchosttest
PASS: virnettlssessiontest
PASS: scsihosttest
PASS: vircaps2xmltest
PASS: fdstreamtest
PASS: virnettlscontexttest
PASS: virdbustest
PASS: virsystemdtest
PASS: virpolkittest
PASS: securityselinuxtest
PASS: viridentitytest
PASS: virdrivermoduletest
PASS: securityselinuxlabeltest
PASS: xml2sexprtest
PASS: sexpr2xmltest
PASS: xmconfigtest
PASS: xencapstest
PASS: xlconfigtest
PASS: qemuargv2xmltest
PASS: qemuxml2argvtest
PASS: qemuhelptest
PASS: qemuxml2xmltest
PASS: domainsnapshotxml2xmltest
PASS: qemumonitortest
PASS: qemumonitorjsontest
PASS: qemuagenttest
PASS: qemuhotplugtest
PASS: qemucaps2xmltest
PASS: qemucapabilitiestest
PASS: qemumemlocktest
PASS: lxcconf2xmltest
PASS: lxcxml2xmltest
PASS: qemucommandutiltest
PASS: openvzutilstest
PASS: esxutilstest
PASS: vboxsnapshotxmltest
PASS: xml2vmxtest
PASS: vmx2xmltest
PASS: vmwarevertest
PASS: jsontest
PASS: networkxml2xmltest
PASS: networkxml2xmlupdatetest
PASS: networkxml2conftest
PASS: networkxml2firewalltest
PASS: storagebackendsheepdogtest
PASS: nwfilterxml2xmltest
PASS: nwfilterebiptablestest
PASS: nwfilterxml2firewalltest
PASS: storagevolxml2argvtest
PASS: virstorageutiltest
PASS: virscsitest
PASS: nsstest
PASS: nssguesttest
PASS: storagevolxml2xmltest
PASS: storagepoolxml2xmltest
PASS: nodedevxml2xmltest
PASS: interfacexml2xmltest
PASS: virstoragetest
PASS: metadatatest
PASS: cputest
PASS: secretxml2xmltest
PASS: genericxml2xmltest
PASS: virusbtest
PASS: virnetdevbandwidthtest
PASS: objecteventtest
PASS: virmacmaptest
PASS: eventtest
PASS: libvirtd-pool
PASS: virsh-cpuset
PASS: virsh-define-dev-segfault
SKIP: virsh-optparse
PASS: libvirtd-fail
PASS: virsh-int-overflow
PASS: virsh-schedinfo
PASS: virsh-read-non-seekable
PASS: virsh-read-bufsiz
PASS: virsh-self-test
PASS: virsh-start
PASS: virt-admin-self-test
PASS: virsh-undefine
PASS: virsh-uriprecedence
PASS: virsh-vcpupin
============================================================================
Testsuite summary for libvirt 3.5.0
============================================================================
# TOTAL: 125
# PASS:  123
# SKIP:  1
# XFAIL: 0
# FAIL:  1
# XPASS: 0
# ERROR: 0
============================================================================
See tests/test-suite.log
Please report to libvir-list redhat com
============================================================================
Makefile:5894: recipe for target 'test-suite.log' failed
make[3]: *** [test-suite.log] Error 1
make[3]: Leaving directory '<https://ci.centos.org/job/libvirt-master-check/systems=libvirt-fedora-24/ws/build/tests'>
Makefile:6000: recipe for target 'check-TESTS' failed
make[2]: *** [check-TESTS] Error 2
make[2]: Leaving directory '<https://ci.centos.org/job/libvirt-master-check/systems=libvirt-fedora-24/ws/build/tests'>
Makefile:6976: recipe for target 'check-am' failed
make[1]: *** [check-am] Error 2
make[1]: Leaving directory '<https://ci.centos.org/job/libvirt-master-check/systems=libvirt-fedora-24/ws/build/tests'>
Makefile:2109: recipe for target 'check-recursive' failed
make: *** [check-recursive] Error 1
+ cat tests/test-suite.log
=========================================
   libvirt 3.5.0: tests/test-suite.log
=========================================

# TOTAL: 125
# PASS:  123
# SKIP:  1
# XFAIL: 0
# FAIL:  1
# XPASS: 0
# ERROR: 0

.. contents:: :depth: 2

FAIL: virnetsockettest
======================

TEST: virnetsockettest
      .....!!!.!!!                             12  FAIL
FAIL virnetsockettest (exit status: 1)

SKIP: virsh-optparse
====================

../../tests/virsh-optparse: skipping test: 
This test is very expensive, so it is disabled by default.
To run it anyway, rerun: make check VIR_TEST_EXPENSIVE=1

SKIP virsh-optparse (exit status: 77)

+ exit 1
Build step 'Execute shell' marked build as failure


[Date Prev][Date Next]   [Thread Prev][Thread Next]   [Thread Index] [Date Index] [Author Index]