[Date Prev][Date Next]   [Thread Prev][Thread Next]   [Thread Index] [Date Index] [Author Index]

[Libvirt-ci] Build failed in Jenkins: libvirt-master- mingw » libvirt-fedora-rawhide #889



https://ci.centos.org/job/libvirt-master-mingw/systems=libvirt-fedora-rawhide/889/Changes:

[abologna] Post-release version bump to 3.2.0

[abologna] qemu: Drop QEMU_CAPS_PCI_MULTIBUS

[abologna] tests: Fix aliases for pSeries buses

[abologna] qemu: Don't omit parentheses

[abologna] qemu: Use ARCH_IS_X86() more

------------------------------------------
[...truncated 142.99 KB...]
  CC       virsh-virsh-domain-monitor.o
  CC       virsh-virsh-host.o
  CC       virsh-virsh-interface.o
  CC       virsh-virsh-network.o
  CC       virsh-virsh-nodedev.o
  CC       virsh-virsh-nwfilter.o
  CC       virsh-virsh-pool.o
  CC       virsh-virsh-secret.o
  CC       virsh-virsh-snapshot.o
  CC       virsh-virsh-volume.o
  GEN      virsh_win_icon.o
  CC       virt_admin-virt-admin.o
  GEN      virt-xml-validate
  GEN      virt-pki-validate
  GEN      virt-pki-validate.1.in
  GEN      virt-xml-validate.1.in
  GEN      virsh.1.in
  GEN      virt-admin.1.in
  CCLD     libvirt_shell.la
  GEN      virt-pki-validate.1
  GEN      virt-xml-validate.1
  GEN      virsh.1
  GEN      virt-admin.1
  CCLD     virsh.exe
  CCLD     virt-admin.exe
libtool:   error: Could not determine the host path corresponding to
libtool:   error:   '<https://ci.centos.org/job/libvirt-master-mingw/systems=libvirt-fedora-rawhide/ws/build32/src/.libs'>
libtool:   error: Continuing, but uninstalled executables may not work.
libtool:   error: Could not determine the host path corresponding to
libtool:   error:   '<https://ci.centos.org/job/libvirt-master-mingw/systems=libvirt-fedora-rawhide/ws/build32/src/.libs>:/home/jenkins/build/libvirt/i686-w64-mingw32/sys-root/mingw/lib:/home/jenkins/build/libvirt/i686-w64-mingw32/sys-root/mingw/bin'
libtool:   error: Continuing, but uninstalled executables may not work.
libtool:   error: Could not determine the host path corresponding to
libtool:   error:   '<https://ci.centos.org/job/libvirt-master-mingw/systems=libvirt-fedora-rawhide/ws/build32/src/.libs'>
libtool:   error: Continuing, but uninstalled executables may not work.
libtool:   error: Could not determine the host path corresponding to
libtool:   error:   '/usr/i686-w64-mingw32/sys-root/mingw/lib:/usr/i686-w64-mingw32/sys-root/mingw/bin:<https://ci.centos.org/job/libvirt-master-mingw/systems=libvirt-fedora-rawhide/ws/build32/src/.libs>:/home/jenkins/build/libvirt/i686-w64-mingw32/sys-root/mingw/lib:/home/jenkins/build/libvirt/i686-w64-mingw32/sys-root/mingw/bin'
libtool:   error: Continuing, but uninstalled executables may not work.
make[3]: Leaving directory '<https://ci.centos.org/job/libvirt-master-mingw/systems=libvirt-fedora-rawhide/ws/build32/tools'>
make[2]: Leaving directory '<https://ci.centos.org/job/libvirt-master-mingw/systems=libvirt-fedora-rawhide/ws/build32/tools'>
Making all in docs
make[2]: Entering directory '<https://ci.centos.org/job/libvirt-master-mingw/systems=libvirt-fedora-rawhide/ws/build32/docs'>
  GEN      ../../docs/apibuild.py.stamp
  GEN      ../../docs/aclperms.htmlinc
  GEN      news.html.in
  GEN      ../../docs/aclperms.htmlinc
Generating uri.html.tmp
Generating testsuites.html.tmp
Generating drvlxc.html.tmp
Generating news-2013.html.tmp
Generating news-2012.html.tmp
Generating drvvmware.html.tmp
Generating governance.html.tmp
Generating locking-sanlock.html.tmp
Generating python.html.tmp
Generating news-2014.html.tmp
Generating testtck.html.tmp
Generating drivers.html.tmp
Generating testapi.html.tmp
Generating api_extension.html.tmp
Generating devguide.html.tmp
Generating logging.html.tmp
Generating errors.html.tmp
Generating migration.html.tmp
Generating format.html.tmp
Generating drvopenvz.html.tmp
Generating drvhyperv.html.tmp
Generating drvremote.html.tmp
Generating docs.html.tmp
Generating downloads.html.tmp
Generating formatstorageencryption.html.tmp
Generating virshcmdref.html.tmp
Generating news-2009.html.tmp
Generating auditlog.html.tmp
Generating locking.html.tmp
Generating formatstorage.html.tmp
Generating api.html.tmp
Generating formatnetwork.html.tmp
Generating auth.html.tmp
Generating news-2010.html.tmp
Generating compiling.html.tmp
Generating drvesx.html.tmp
Generating drvvbox.html.tmp
Generating contribute.html.tmp
Generating drvuml.html.tmp
Generating drvqemu.html.tmp
Generating index.html.tmp
Generating drvxen.html.tmp
Generating news-2015.html.tmp
Generating secureusage.html.tmp
Generating news-2008.html.tmp
Generating hooks.html.tmp
Generating firewall.html.tmp
Generating apps.html.tmp
Generating news-2016.html.tmp
Generating drvbhyve.html.tmp
touch ../../docs/apibuild.py.stamp
Generating php.html.tmp
Generating drvtest.html.tmp
Generating news-2007.html.tmp
Generating locking-lockd.html.tmp
Generating goals.html.tmp
Generating formatnwfilter.html.tmp
Generating 404.html.tmp
Generating news-2011.html.tmp
Generating storage.html.tmp
Generating drvvirtuozzo.html.tmp
Generating formatdomain.html.tmp
Generating securityprocess.html.tmp
Generating windows.html.tmp
Generating architecture.html.tmp
Generating formatnode.html.tmp
Generating news-2005.html.tmp
Generating acl.html.tmp
Generating aclpolkit.html.tmp
Generating java.html.tmp
Generating drvphyp.html.tmp
Generating news-2006.html.tmp
Generating bugs.html.tmp
Generating formatsnapshot.html.tmp
Generating bindings.html.tmp
Generating cgroups.html.tmp
Generating formatcaps.html.tmp
Generating formatsecret.html.tmp
Generating internals.html.tmp
Generating remote.html.tmp
Generating csharp.html.tmp
Generating contact.html.tmp
Generating nss.html.tmp
Generating hacking.html.tmp
Generating formatdomaincaps.html.tmp
Generating internals/locking.html.tmp
Generating internals/eventloop.html.tmp
Generating internals/rpc.html.tmp
Generating internals/command.html.tmp
Generating internals/oomtesting.html.tmp
Generating search.php.tmp
  GEN      ../../docs/hvsupport.html.in
Generating news.html.tmp
Validating uri.html
Validating testsuites.html
Validating drvlxc.html
Validating news-2012.html
Validating news-2013.html
Validating drvvmware.html
Validating governance.html
Validating locking-sanlock.html
Validating python.html
Validating news-2014.html
Validating drivers.html
Validating testtck.html
Validating testapi.html
Validating api_extension.html
Validating devguide.html
Validating logging.html
Validating errors.html
Validating migration.html
Validating format.html
Validating drvopenvz.html
Validating drvhyperv.html
Validating drvremote.html
Validating docs.html
Validating downloads.html
Validating formatstorageencryption.html
Validating virshcmdref.html
Validating news-2009.html
Validating auditlog.html
Validating formatstorage.html
Validating locking.html
Validating api.html
Validating formatnetwork.html
Validating auth.html
Validating news-2010.html
Validating compiling.html
Validating drvesx.html
Validating drvvbox.html
Validating contribute.html
Validating drvuml.html
Validating drvqemu.html
Validating index.html
Validating drvxen.html
Validating news-2015.html
Validating secureusage.html
Validating news-2008.html
Validating hooks.html
Validating firewall.html
Validating apps.html
Validating news-2016.html
Validating drvbhyve.html
Validating drvtest.html
Validating php.html
Validating locking-lockd.html
Validating news-2007.html
Validating goals.html
Validating 404.html
Validating formatnwfilter.html
Validating news-2011.html
Validating storage.html
Validating drvvirtuozzo.html
Validating formatdomain.html
Validating securityprocess.html
Validating windows.html
Validating formatnode.html
Validating architecture.html
Validating news-2005.html
Validating aclpolkit.html
Validating acl.html
Validating java.html
Validating drvphyp.html
Validating news-2006.html
Validating bugs.html
Validating formatsnapshot.html
Validating bindings.html
Validating cgroups.html
Validating formatsecret.html
Validating formatcaps.html
Validating internals.html
Validating csharp.html
Validating remote.html
Validating contact.html
Validating hacking.html
Validating nss.html
Validating formatdomaincaps.html
Validating internals/locking.html
Validating internals/eventloop.html
Validating internals/rpc.html
Validating internals/command.html
Validating internals/oomtesting.html
  GEN      html/index.html
  GEN      ../../docs/devhelp/index.html
Scripting search.php
Generating hvsupport.html.tmp
Validating news.html
news.html.tmp:30: element ul: validity error : Element ul content does not follow the DTD, expecting (li)+, got 
            <ul></ul>
                     ^
news.html.tmp:34: element ul: validity error : Element ul content does not follow the DTD, expecting (li)+, got 
            <ul></ul>
                     ^
news.html.tmp:38: element ul: validity error : Element ul content does not follow the DTD, expecting (li)+, got 
            <ul></ul>
                     ^
make[2]: *** [Makefile:2332: news.html] Error 1
make[2]: *** Waiting for unfinished jobs....
rm internals/rpc.html.tmp drvopenvz.html.tmp logging.html.tmp aclpolkit.html.tmp windows.html.tmp formatnwfilter.html.tmp php.html.tmp formatnetwork.html.tmp locking.html.tmp formatstorageencryption.html.tmp drvhyperv.html.tmp format.html.tmp errors.html.tmp formatdomaincaps.html.tmp virshcmdref.html.tmp news-2006.html.tmp formatcaps.html.tmp internals.html.tmp news-2016.html.tmp auditlog.html.tmp downloads.html.tmp internals/oomtesting.html.tmp bugs.html.tmp drvphyp.html.tmp contact.html.tmp java.html.tmp testapi.html.tmp contribute.html.tmp drvesx.html.tmp locking-lockd.html.tmp drvqemu.html.tmp drvvmware.html.tmp architecture.html.tmp drvvirtuozzo.html.tmp search.php.tmp formatsnapshot.html.tmp acl.html.tmp news-2005.html.tmp drvxen.html.tmp securityprocess.html.tmp 404.html.tmp api_extension.html.tmp news-2008.html.tmp news-2015.html.tmp secureusage.html.tmp python.html.tmp drvremote.html.tmp hooks.html.tmp internals/locking.html.tmp remote.html.tmp drivers.html.tmp compiling.html.tmp formatsecret.html.tmp news.html.tmp formatnode.html.tmp internals/eventloop.html.tmp goals.html.tmp apps.html.tmp formatdomain.html.tmp internals/command.html.tmp drvvbox.html.tmp csharp.html.tmp formatstorage.html.tmp governance.html.tmp drvuml.html.tmp hacking.html.tmp cgroups.html.tmp news-2013.html.tmp news-2007.html.tmp bindings.html.tmp api.html.tmp news-2010.html.tmp news-2009.html.tmp news-2011.html.tmp index.html.tmp drvlxc.html.tmp uri.html.tmp news-2012.html.tmp hvsupport.html.tmp locking-sanlock.html.tmp drvtest.html.tmp testtck.html.tmp docs.html.tmp devguide.html.tmp drvbhyve.html.tmp testsuites.html.tmp nss.html.tmp news-2014.html.tmp migration.html.tmp storage.html.tmp firewall.html.tmp auth.html.tmp
make[2]: Leaving directory '<https://ci.centos.org/job/libvirt-master-mingw/systems=libvirt-fedora-rawhide/ws/build32/docs'>
make[1]: *** [Makefile:2082: all-recursive] Error 1
make[1]: Leaving directory '<https://ci.centos.org/job/libvirt-master-mingw/systems=libvirt-fedora-rawhide/ws/build32'>
make: *** [Makefile:1979: all] Error 2
Build step 'Execute shell' marked build as failure


[Date Prev][Date Next]   [Thread Prev][Thread Next]   [Thread Index] [Date Index] [Author Index]