[Date Prev][Date Next]   [Thread Prev][Thread Next]   [Thread Index] [Date Index] [Author Index]

[Libvirt-ci] Build failed in Jenkins: libvirt-master- rpm » libvirt-centos-6 #222



https://ci.centos.org/job/libvirt-master-rpm/systems=libvirt-centos-6/222/------------------------------------------
[...truncated 189.24 KB...]
configure: virtualport: yes (CFLAGS='' LIBS='')
configure:        xdr: yes (CFLAGS='' LIBS='')
configure:        xen: no 
configure:     xenapi: no 
configure:       yajl: yes (CFLAGS='' LIBS='-lyajl')
configure: 
configure: Windows
configure: 
configure:     Cygwin: no 
configure:      MinGW: no 
configure:       MSVC: no 
configure:    windres: no 
configure: 
configure: Test suite
configure: 
configure:          Coverage: 
configure:         Alloc OOM: 
configure: 
configure: Miscellaneous
configure: 
configure:              Debug: yes
configure:        Use -Werror: yes
configure:      Warning Flags:  -fno-common -W -Waddress -Wall -Wattributes -Wbad-function-cast -Wbuiltin-macro-redefined -Wchar-subscripts -Wclobbered -Wcomment -Wcomments -Wcoverage-mismatch -Wdeprecated-declarations -Wdisabled-optimization -Wdiv-by-zero -Wempty-body -Wendif-labels -Wextra -Wformat-contains-nul -Wformat-extra-args -Wformat-security -Wformat-y2k -Wformat-zero-length -Wignored-qualifiers -Wimplicit -Wimplicit-function-declaration -Wimplicit-int -Winit-self -Winline -Wint-to-pointer-cast -Winvalid-pch -Wlogical-op -Wmain -Wmissing-braces -Wmissing-field-initializers -Wmissing-include-dirs -Wmissing-parameter-type -Wmultichar -Wnested-externs -Wnonnull -Wold-style-declaration -Wold-style-definition -Woverflow -Woverride-init -Wpacked-bitfield-compat -Wparentheses -Wpointer-arith -Wpointer-sign -Wpointer-to-int-cast -Wpragmas -Wreturn-type -Wsequence-point -Wshadow -Wstrict-aliasing -Wstrict-prototypes -Wswitch -Wsync-nand -Wtrigraphs -Wtype-limits -Wuninitialized -Wunknown-pragmas -Wunused -Wunused-but-set-parameter -Wunused-but-set-variable -Wunused-function -Wunused-label -Wunused-parameter -Wunused-value -Wunused-variable -Wvariadic-macros -Wvolatile-register-var -Wwrite-strings -Wnormalized=nfc -fdiagnostics-show-option -funit-at-a-time -Wno-missing-field-initializers -Wno-sign-compare -Wno-format-nonliteral -Wframe-larger-than=4096 -fexceptions -fasynchronous-unwind-tables -fipa-pure-const -Werror -fstack-protector-all
configure:             DTrace: yes
configure:              numad: yes
configure:        XML Catalog: /etc/xml/catalog
configure:        Init script: redhat
configure:  Char device locks: /var/lock
configure:     Default Editor: vi
configure:       Loader/NVRAM: 
configure:   virt-login-shell: yes
configure: virt-host-validate: yes
configure:       TLS priority: NORMAL
configure: 
configure: Developer Tools
configure: 
configure: wireshark_dissector: no 
configure: 
configure: Privileges
configure: 
configure:       QEMU: qemu:qemu
configure: 
+ make -j2
make  all-recursive
make[1]: Entering directory `/home/jenkins/rpmbuild/BUILD/libvirt-3.2.0'
Making all in .
make[2]: Entering directory `/home/jenkins/rpmbuild/BUILD/libvirt-3.2.0'
make[2]: Leaving directory `/home/jenkins/rpmbuild/BUILD/libvirt-3.2.0'
Making all in gnulib/lib
make[2]: Entering directory `/home/jenkins/rpmbuild/BUILD/libvirt-3.2.0/gnulib/lib'
  GEN    alloca.h
  GEN    c++defs.h
  GEN    warn-on-use.h
  GEN    arg-nonnull.h
  GEN    configmake.h
  GEN    langinfo.h
  GEN    limits.h
  GEN    locale.h
  GEN    netdb.h
  GEN    poll.h
  GEN    pty.h
  GEN    signal.h
  GEN    unused-parameter.h
  GEN    stdalign.h
  GEN    stddef.h
  GEN    stdint.h
  GEN    stdio.h
  GEN    stdlib.h
  GEN    string.h
  GEN    strings.h
  GEN    sys/ioctl.h
  GEN    sys/select.h
  GEN    sys/socket.h
  GEN    sys/stat.h
  GEN    sys/time.h
  GEN    sys/types.h
  GEN    sys/uio.h
  GEN    sys/wait.h
  GEN    sys/utsname.h
  GEN    time.h
  GEN    termios.h
  GEN    wchar.h
  GEN    unistd.h
  GEN    wctype.h
  GEN    fcntl.h
  GEN    arpa/inet.h
  GEN    fnmatch.h
  GEN    getopt.h
make  all-am
make[3]: Entering directory `/home/jenkins/rpmbuild/BUILD/libvirt-3.2.0/gnulib/lib'
  CC     allocator.lo
  CC     areadlink.lo
  CC     base64.lo
  CC     binary-io.lo
  CC     bitrotate.lo
  CC     c-ctype.lo
  CC     c-strcasecmp.lo
  CC     c-strncasecmp.lo
  CC     c-strcasestr.lo
  CC     careadlinkat.lo
  CC     cloexec.lo
  CC     count-leading-zeros.lo
  CC     count-one-bits.lo
  CC     md5.lo
  CC     sha256.lo
  CC     dirname-lgpl.lo
  CC     basename-lgpl.lo
  CC     stripslash.lo
  CC     fd-hook.lo
  CC     freading.lo
  CC     getugroups.lo
  CC     hard-locale.lo
  CC     localcharset.lo
  CC     malloca.lo
  CC     mgetgroups.lo
  CC     nonblocking.lo
  CC     passfd.lo
  CC     physmem.lo
  CC     pipe2.lo
  CC     sig-handler.lo
  CC     sockets.lo
  CC     stat-time.lo
  CC     strnlen1.lo
  CC     sys_socket.lo
  CC     tempname.lo
  CC     glthread/threadlib.lo
  CC     unistd.lo
  CC     wctype-h.lo
  CC     xsize.lo
  CC     asnprintf.lo
  CC     fclose.lo
  CC     fcntl.lo
  CC     fflush.lo
  CC     fnmatch.lo
  CC     fpurge.lo
  CC     fseek.lo
  CC     fseeko.lo
  CC     getopt.lo
  CC     getopt1.lo
  CC     ioctl.lo
  CC     mbrtowc.lo
  CC     mktime.lo
  CC     perror.lo
  CC     printf-args.lo
  CC     printf-parse.lo
  CC     secure_getenv.lo
  CC     strerror.lo
  CC     strerror_r.lo
  CC     vasnprintf.lo
  GEN    charset.alias
  GEN    ref-add.sed
  GEN    ref-del.sed
  CC     glthread/lock.lo
  CCLD   libgnu.la
make[3]: Leaving directory `/home/jenkins/rpmbuild/BUILD/libvirt-3.2.0/gnulib/lib'
make[2]: Leaving directory `/home/jenkins/rpmbuild/BUILD/libvirt-3.2.0/gnulib/lib'
Making all in include/libvirt
make[2]: Entering directory `/home/jenkins/rpmbuild/BUILD/libvirt-3.2.0/include/libvirt'
make[2]: Nothing to be done for `all'.
make[2]: Leaving directory `/home/jenkins/rpmbuild/BUILD/libvirt-3.2.0/include/libvirt'
Making all in src
make[2]: Entering directory `/home/jenkins/rpmbuild/BUILD/libvirt-3.2.0/src'
  GEN    libvirt_access.xml
  GEN    libvirt_access_qemu.xml
  GEN    libvirt_access_lxc.xml
  GEN    libvirt_access.syms
  GEN    libvirt_access_qemu.syms
  GEN    libvirt_access_lxc.syms
  GEN    libvirt_qemu.def
  GEN    libvirt_lxc.def
  GEN    libvirt_admin.syms
  GEN    libvirt_probes.h
  GEN    libvirt_probes.stp
  GEN    libvirt_functions.stp
  GEN    libvirt_qemu_probes.h
  GEN    locking/qemu-lockd.conf
  GEN    virtlockd.init
  GEN    locking/qemu-sanlock.conf
  GEN    libvirt.syms
  GEN    virtlogd.init
  GEN    libvirt_admin.def
  GEN    libvirt.def
make  all-am
make[3]: Entering directory `/home/jenkins/rpmbuild/BUILD/libvirt-3.2.0/src'
  CC     libvirt_driver_la-driver.lo
  CC     libvirt_driver_la-datatypes.lo
  CC     libvirt_driver_la-fdstream.lo
  CC     libvirt_driver_la-nodeinfo.lo
  CC     libvirt_driver_la-libvirt.lo
  CC     libvirt_driver_la-libvirt-domain.lo
  CC     libvirt_driver_la-libvirt-domain-snapshot.lo
  CC     libvirt_driver_la-libvirt-host.lo
  CC     libvirt_driver_la-libvirt-interface.lo
  CC     libvirt_driver_la-libvirt-network.lo
  CC     libvirt_driver_la-libvirt-nodedev.lo
  CC     libvirt_driver_la-libvirt-nwfilter.lo
  CC     libvirt_driver_la-libvirt-secret.lo
  CC     libvirt_driver_la-libvirt-storage.lo
  CC     libvirt_driver_la-libvirt-stream.lo
  GEN    libvirt_probes.o
  CC     libvirt_qemu_la-libvirt-qemu.lo
  CC     libvirt_lxc_la-libvirt-lxc.lo
  CC     libvirt_admin_la-libvirt-admin.lo
  CC     libvirt_admin_la-datatypes.lo
  CC     locking/lockd_la-lock_driver_lockd.lo
  CC     locking/lockd_la-lock_protocol.lo
  CC     locking/sanlock_la-lock_driver_sanlock.lo
  GEN    libvirt_qemu_probes.o
  CC     secret/libvirt_driver_secret_la-secret_driver.lo
  CC     util/libvirt_setuid_rpc_client_la-viralloc.lo
  CC     util/libvirt_setuid_rpc_client_la-viratomic.lo
  CC     util/libvirt_setuid_rpc_client_la-virbitmap.lo
  CC     util/libvirt_setuid_rpc_client_la-virbuffer.lo
  CC     util/libvirt_setuid_rpc_client_la-vircgroup.lo
  CC     util/libvirt_setuid_rpc_client_la-vircommand.lo
  CC     util/libvirt_setuid_rpc_client_la-virconf.lo
  CC     util/libvirt_setuid_rpc_client_la-virdbus.lo
  CC     util/libvirt_setuid_rpc_client_la-virerror.lo
  CC     util/libvirt_setuid_rpc_client_la-virevent.lo
  CC     util/libvirt_setuid_rpc_client_la-vireventpoll.lo
  CC     util/libvirt_setuid_rpc_client_la-virfile.lo
  CC     util/libvirt_setuid_rpc_client_la-virgettext.lo
  CC     util/libvirt_setuid_rpc_client_la-virhash.lo
  CC     util/libvirt_setuid_rpc_client_la-virhashcode.lo
  CC     util/libvirt_setuid_rpc_client_la-virhostcpu.lo
  CC     util/libvirt_setuid_rpc_client_la-virjson.lo
  CC     util/libvirt_setuid_rpc_client_la-virlog.lo
  CC     util/libvirt_setuid_rpc_client_la-virobject.lo
  CC     util/libvirt_setuid_rpc_client_la-virpidfile.lo
  CC     util/libvirt_setuid_rpc_client_la-virprocess.lo
  CC     util/libvirt_setuid_rpc_client_la-virrandom.lo
  CC     util/libvirt_setuid_rpc_client_la-virsocketaddr.lo
  CC     util/libvirt_setuid_rpc_client_la-virstring.lo
  CC     util/libvirt_setuid_rpc_client_la-virsystemd.lo
util/virsystemd.c:30:28: error: virsystemdpriv.h: No such file or directory
make[3]: *** [util/libvirt_setuid_rpc_client_la-virsystemd.lo] Error 1
make[3]: *** Waiting for unfinished jobs....
make[3]: Leaving directory `/home/jenkins/rpmbuild/BUILD/libvirt-3.2.0/src'
make[2]: *** [all] Error 2
make[2]: Leaving directory `/home/jenkins/rpmbuild/BUILD/libvirt-3.2.0/src'
make[1]: *** [all-recursive] Error 1
make[1]: Leaving directory `/home/jenkins/rpmbuild/BUILD/libvirt-3.2.0'
make: *** [all] Error 2
error: Bad exit status from /var/tmp/rpm-tmp.exNBLf (%build)


RPM build errors:
    Bad exit status from /var/tmp/rpm-tmp.exNBLf (%build)
Build step 'Execute shell' marked build as failure


[Date Prev][Date Next]   [Thread Prev][Thread Next]   [Thread Index] [Date Index] [Author Index]