[Date Prev][Date Next]   [Thread Prev][Thread Next]   [Thread Index] [Date Index] [Author Index]

[Libvirt-ci] Build failed in Jenkins: libvirt-master- build » libvirt-fedora-rawhide #1648



See <https://ci.centos.org/job/libvirt-master-build/systems=libvirt-fedora-rawhide/1648/display/redirect?page=changes>

Changes:

[pkrempa] util: jsoncompat: Stub out virJSONInitialize when compiling without

[pkrempa] remote: daemon: Make sure that JSON symbols are properly loaded at

[mprivozn] util: Don't overflow in virRandomBits

[mprivozn] viriscsi: Request more random bits for interface name

------------------------------------------
[...truncated 173.24 KB...]
gmake[3]: Entering directory '<https://ci.centos.org/job/libvirt-master-build/systems=libvirt-fedora-rawhide/ws/build/gnulib/tests'>
Making all in .
gmake[4]: Entering directory '<https://ci.centos.org/job/libvirt-master-build/systems=libvirt-fedora-rawhide/ws/build/gnulib/tests'>
  CC       test-localcharset.o
  CC       exitfail.o
  CC       fatal-signal.o
  CC       getprogname.o
  CC       math.o
  CC       localename.o
  CC       wait-process.o
  CC       xmalloc.o
  CC       xalloc-die.o
  CC       nanosleep.o
  CC       glthread/thread.o
  AR       libtests.a
  CCLD     test-localcharset
gmake[4]: Leaving directory '<https://ci.centos.org/job/libvirt-master-build/systems=libvirt-fedora-rawhide/ws/build/gnulib/tests'>
gmake[3]: Leaving directory '<https://ci.centos.org/job/libvirt-master-build/systems=libvirt-fedora-rawhide/ws/build/gnulib/tests'>
gmake[2]: Leaving directory '<https://ci.centos.org/job/libvirt-master-build/systems=libvirt-fedora-rawhide/ws/build/gnulib/tests'>
Making all in tests
gmake[2]: Entering directory '<https://ci.centos.org/job/libvirt-master-build/systems=libvirt-fedora-rawhide/ws/build/tests'>
  CC       virshtest.o
  CC       testutils.o
  CC       sockettest.o
  CC       virhostcputest.o
  CC       virfilewrapper.o
  CC       virbuftest.o
  CC       commandtest.o
  CC       seclabeltest.o
  CC       virhashtest.o
  CC       virconftest.o
  CC       viratomictest.o
  CC       utiltest.o
  CC       shunloadtest.o
  CC       shunloadhelper.lo
  CC       virtimetest.o
  CC       viruritest.o
  CC       virkeyfiletest.o
  CC       viralloctest.o
  CC       virauthconfigtest.o
  CC       virbitmaptest.o
  CC       vircgrouptest.o
  CC       vircryptotest.o
  CC       virpcitest.o
  CC       virendiantest.o
  CC       virfiletest.o
  CC       virfilecachetest.o
  CC       virfirewalltest-virfirewalltest.o
  CC       virfirewalltest-testutils.o
  CC       viriscsitest.o
  CC       virkeycodetest.o
  CC       virlockspacetest.o
  CC       virlogtest.o
  CC       virrotatingfiletest.o
  CC       virschematest.o
  CC       virstringtest.o
  CC       virportallocatortest.o
  CC       sysinfotest.o
  CC       virkmodtest.o
  CC       vircapstest.o
  CC       testutilslxc.o
  CC       testutilsqemu.o
  CC       domaincapstest.o
  CC       testutilsxen.o
  CCLD     libqemutestdriver.la
  CC       domainconftest.o
  CC       virhostdevtest.o
  CC       virnetdevtest-virnetdevtest.o
  CC       virnetdevtest-testutils.o
  CC       virtypedparamtest.o
  CC       virnetmessagetest.o
  CC       virnetsockettest.o
  CC       virnetdaemontest.o
  CC       virnetserverclienttest.o
  CC       virnettlscontexttest.o
  CC       virnettlshelpers.o
  CC       pkix_asn1_tab.o
  CC       virnettlssessiontest.o
  CC       fchosttest.o
  CC       scsihosttest.o
  CC       vircaps2xmltest.o
  CC       virresctrltest.o
  CC       fdstreamtest.o
  CC       virdbustest-virdbustest.o
  CC       virdbustest-testutils.o
  CC       virsystemdtest-virsystemdtest.o
  CC       virsystemdtest-testutils.o
  CC       virpolkittest-virpolkittest.o
  CC       virpolkittest-testutils.o
  CC       securityselinuxtest.o
  CC       securityselinuxhelper.lo
  CC       viridentitytest.o
  CC       securityselinuxlabeltest.o
  CC       xlconfigtest.o
  CC       xml2sexprtest.o
  CC       sexpr2xmltest.o
  CC       xmconfigtest.o
  CC       libxlxml2domconfigtest.o
  CC       qemuxml2argvtest.o
  CC       qemuxml2xmltest.o
  CC       qemuargv2xmltest.o
  CC       domainsnapshotxml2xmltest.o
  CC       qemumonitorjsontest.o
  CC       qemumonitortestutils.lo
  CC       testutilsqemuschema.lo
  CC       qemuhotplugtest.o
  CC       qemuagenttest.o
  CC       qemucapabilitiestest.o
  CC       qemucaps2xmltest.o
  CC       qemumemlocktest.o
  CC       qemucommandutiltest.o
  CC       qemublocktest.o
  CC       qemumigparamstest.o
  CC       lxcxml2xmltest.o
  CC       lxcconf2xmltest.o
  CC       openvzutilstest.o
  CC       esxutilstest.o
  CC       vboxsnapshotxmltest.o
  CC       vmx2xmltest.o
  CC       xml2vmxtest.o
  CC       vmwarevertest.o
  CC       virjsontest.o
  CC       networkxml2xmltest.o
  CC       networkxml2xmlupdatetest.o
  CC       networkxml2conftest.o
  CC       networkxml2firewalltest.o
  CC       storagebackendsheepdogtest.o
  CC       nwfilterxml2xmltest.o
  CC       virnwfilterbindingxml2xmltest.o
  CC       nwfilterebiptablestest.o
  CC       nwfilterxml2firewalltest.o
  CC       storagevolxml2argvtest.o
  CC       virstorageutiltest.o
  CC       virstoragetest.o
  CC       virscsitest.o
  CC       nsstest-nsstest.o
  CC       nsstest-testutils.o
  CC       nssguesttest-nsstest.o
  CC       nssguesttest-testutils.o
  CC       storagevolxml2xmltest.o
  CC       storagepoolxml2xmltest.o
  CC       nodedevxml2xmltest.o
  CC       interfacexml2xmltest.o
  CC       cputest.o
  CC       metadatatest.o
  CC       secretxml2xmltest.o
  CC       genericxml2xmltest.o
  CC       virusbtest.o
  CC       virnetdevbandwidthtest.o
  CC       eventtest.o
  CC       virdrivermoduletest.o
  CC       objecteventtest.o
  CC       virmacmaptest.o
  CC       commandhelper.o
  CC       ssh.o
  CC       qemucapsprobe.o
  CC       nsslinktest-nsslinktest.o
  CC       nssguestlinktest-nsslinktest.o
  CC       virportallocatormock.lo
  CC       virnetdaemonmock.lo
  CC       virnetserverclientmock.lo
  CC       vircgroupmock.lo
  CC       virpcimock.lo
  CC       virnetdevmock_la-virnetdevmock.lo
  CC       virrandommock.lo
  CC       virhostcpumock.lo
  CC       domaincapsmock.lo
  CC       virfilecachemock.lo
  CC       virusbmock.lo
  CC       virnetdevbandwidthmock.lo
  CC       virnumamock.lo
  CC       virtestmock.lo
  CC       virdbusmock_la-virdbusmock.lo
  CC       virmocklibxl_la-virmocklibxl.lo
  CC       qemuxml2argvmock.lo
  CC       qemucaps2xmlmock.lo
  CC       qemucapsprobemock.lo
  CC       qemucpumock.lo
  CC       nssmock.lo
  CC       virdeterministichashmock.lo
  CCLD     virshtest
  CCLD     sockettest
  CCLD     virhostcputest
  CCLD     virbuftest
  CCLD     commandtest
  CCLD     seclabeltest
  CCLD     virhashtest
  CCLD     virconftest
  CCLD     viratomictest
  CCLD     utiltest
  CCLD     libshunload.la
  CCLD     virtimetest
  CCLD     viruritest
  CCLD     virkeyfiletest
  CCLD     viralloctest
  CCLD     virauthconfigtest
  CCLD     virbitmaptest
  CCLD     vircgrouptest
  CCLD     vircryptotest
  CCLD     virpcitest
  CCLD     virendiantest
  CCLD     virfiletest
  CCLD     virfilecachetest
  CCLD     virfirewalltest
  CCLD     viriscsitest
  CCLD     virkeycodetest
  CCLD     virlockspacetest
  CCLD     virlogtest
  CCLD     virrotatingfiletest
  CCLD     virschematest
  CCLD     virstringtest
  CCLD     virportallocatortest
  CCLD     sysinfotest
  CCLD     virkmodtest
  CCLD     vircapstest
  CCLD     domaincapstest
  CCLD     domainconftest
  CCLD     virhostdevtest
  CCLD     virnetdevtest
  CCLD     virtypedparamtest
  CCLD     virnetmessagetest
  CCLD     virnetsockettest
  CCLD     virnetdaemontest
  CCLD     virnetserverclienttest
  CCLD     virnettlscontexttest
  CCLD     virnettlssessiontest
  CCLD     fchosttest
  CCLD     scsihosttest
  CCLD     vircaps2xmltest
  CCLD     virresctrltest
  CCLD     fdstreamtest
  CCLD     virdbustest
  CCLD     virsystemdtest
  CCLD     virpolkittest
  CCLD     libsecurityselinuxhelper.la
  CCLD     xlconfigtest
  CCLD     xml2sexprtest
  CCLD     sexpr2xmltest
  CCLD     xmconfigtest
  CCLD     libxlxml2domconfigtest
/usr/bin/ld: error while loading shared libraries: libbfd-2.31.1-8.fc29.so: cannot open shared object file: No such file or directory
collect2: error: ld returned 127 exit status
gmake[2]: *** [Makefile:5021: sexpr2xmltest] Error 1
gmake[2]: *** Waiting for unfinished jobs....
gmake[2]: Leaving directory '<https://ci.centos.org/job/libvirt-master-build/systems=libvirt-fedora-rawhide/ws/build/tests'>
gmake[1]: *** [Makefile:2106: all-recursive] Error 1
gmake[1]: Leaving directory '<https://ci.centos.org/job/libvirt-master-build/systems=libvirt-fedora-rawhide/ws/build'>
gmake: *** [Makefile:1999: all] Error 2
Build step 'Execute shell' marked build as failure


[Date Prev][Date Next]   [Thread Prev][Thread Next]   [Thread Index] [Date Index] [Author Index]