[Date Prev][Date Next]   [Thread Prev][Thread Next]   [Thread Index] [Date Index] [Author Index]

[Libvirt-ci] Build failed in Jenkins: libvirt-dbus-ma ster-check » libvirt-fedora-28 #335



See <https://ci.centos.org/job/libvirt-dbus-master-check/systems=libvirt-fedora-28/335/display/redirect>

------------------------------------------
Started by upstream project "libvirt-dbus-master-check" build number 335
originally caused by:
 Started by upstream project "libvirt-dbus-master-build" build number 370
 originally caused by:
  Started by an SCM change
[EnvInject] - Loading node environment variables.
Building remotely on libvirt-fedora-28 (libvirt) in workspace <https://ci.centos.org/job/libvirt-dbus-master-check/systems=libvirt-fedora-28/ws/>
[libvirt-dbus-master] $ /bin/sh -xe /tmp/jenkins8363856996055784095.sh
+ cd build
+ /usr/bin/gmake check
Making check in data
gmake[1]: Entering directory '<https://ci.centos.org/job/libvirt-dbus-master-check/systems=libvirt-fedora-28/ws/build/data'>
gmake[1]: Nothing to be done for 'check'.
gmake[1]: Leaving directory '<https://ci.centos.org/job/libvirt-dbus-master-check/systems=libvirt-fedora-28/ws/build/data'>
Making check in docs
gmake[1]: Entering directory '<https://ci.centos.org/job/libvirt-dbus-master-check/systems=libvirt-fedora-28/ws/build/docs'>
gmake[1]: Nothing to be done for 'check'.
gmake[1]: Leaving directory '<https://ci.centos.org/job/libvirt-dbus-master-check/systems=libvirt-fedora-28/ws/build/docs'>
Making check in src
gmake[1]: Entering directory '<https://ci.centos.org/job/libvirt-dbus-master-check/systems=libvirt-fedora-28/ws/build/src'>
gmake[1]: Nothing to be done for 'check'.
gmake[1]: Leaving directory '<https://ci.centos.org/job/libvirt-dbus-master-check/systems=libvirt-fedora-28/ws/build/src'>
Making check in tests
gmake[1]: Entering directory '<https://ci.centos.org/job/libvirt-dbus-master-check/systems=libvirt-fedora-28/ws/build/tests'>
/usr/bin/gmake  test_util
gmake[2]: Entering directory '<https://ci.centos.org/job/libvirt-dbus-master-check/systems=libvirt-fedora-28/ws/build/tests'>
  CC       test_util-test_util.o
  CCLD     test_util
gmake[2]: Leaving directory '<https://ci.centos.org/job/libvirt-dbus-master-check/systems=libvirt-fedora-28/ws/build/tests'>
/usr/bin/gmake  check-TESTS
gmake[2]: Entering directory '<https://ci.centos.org/job/libvirt-dbus-master-check/systems=libvirt-fedora-28/ws/build/tests'>
gmake[3]: Entering directory '<https://ci.centos.org/job/libvirt-dbus-master-check/systems=libvirt-fedora-28/ws/build/tests'>
PASS: test_util
PASS: test_interface.py
PASS: test_domain.py
FAIL: test_network.py
PASS: test_nodedev.py
PASS: test_connect.py
PASS: test_storage.py
============================================================================
Testsuite summary for libvirt-dbus 1.3.0
============================================================================
# TOTAL: 7
# PASS:  6
# SKIP:  0
# XFAIL: 0
# FAIL:  1
# XPASS: 0
# ERROR: 0
============================================================================
See tests/test-suite.log
Please report to libvir-list redhat com
============================================================================
gmake[3]: *** [Makefile:758: test-suite.log] Error 1
gmake[3]: Leaving directory '<https://ci.centos.org/job/libvirt-dbus-master-check/systems=libvirt-fedora-28/ws/build/tests'>
gmake[2]: *** [Makefile:866: check-TESTS] Error 2
gmake[2]: Leaving directory '<https://ci.centos.org/job/libvirt-dbus-master-check/systems=libvirt-fedora-28/ws/build/tests'>
gmake[1]: *** [Makefile:979: check-am] Error 2
gmake[1]: Leaving directory '<https://ci.centos.org/job/libvirt-dbus-master-check/systems=libvirt-fedora-28/ws/build/tests'>
gmake: *** [Makefile:459: check-recursive] Error 1
+ cat tests/test-suite.log
==============================================
   libvirt-dbus 1.3.0: tests/test-suite.log
==============================================

# TOTAL: 7
# PASS:  6
# SKIP:  0
# XFAIL: 0
# FAIL:  1
# XPASS: 0
# ERROR: 0

.. contents:: :depth: 2

FAIL: test_network.py
=====================

============================= test session starts ==============================
platform linux -- Python 3.6.6, pytest-3.4.2, py-1.5.4, pluggy-0.6.0
rootdir: <https://ci.centos.org/job/libvirt-dbus-master-check/systems=libvirt-fedora-28/ws/,> inifile:
collected 7 items

../../tests/test_network.py ......E                                      [100%]

==================================== ERRORS ====================================
 ERROR at setup of TestNetwork.test_network_update[4-4-0-\n    <host mac='00:16:3e:77:e2:ed' name='foo.example.com' ip='192.168.122.10'/>\n    -0] 

self = <test_network.TestNetwork object at 0x7fba7bb66208>
request = <SubRequest 'libvirt_dbus_setup' for <Function "test_network_update[4-4-0-\\n    <host mac='00:16:3e:77:e2:ed' name='foo.example.com' ip='192.168.122.10'/>\\n    -0]">>

    @pytest.fixture(autouse=True)
    def libvirt_dbus_setup(self, request):
        """Start libvirt-dbus for each test function
            """
        os.environ['LIBVIRT_DEBUG'] = '3'
        self.libvirt_dbus = subprocess.Popen([exe, '--session'])
        self.bus = dbus.SessionBus()
    
        for i in range(10):
            if self.bus.name_has_owner('org.libvirt'):
                break
            time.sleep(0.1)
        else:
>           raise TimeoutError('error starting libvirt-dbus')
E           TimeoutError: error starting libvirt-dbus

../../tests/libvirttest.py:44: TimeoutError
====================== 6 passed, 1 error in 7.45 seconds =======================
FAIL test_network.py (exit status: 1)

+ exit 1
Build step 'Execute shell' marked build as failure


[Date Prev][Date Next]   [Thread Prev][Thread Next]   [Thread Index] [Date Index] [Author Index]