[Date Prev][Date Next]   [Thread Prev][Thread Next]   [Thread Index] [Date Index] [Author Index]

[Libvirt-ci] Build failed in Jenkins: libvirt-sandbox -master-build » libvirt-fedora-rawhide #1319



See <https://ci.centos.org/job/libvirt-sandbox-master-build/systems=libvirt-fedora-rawhide/1319/display/redirect>

------------------------------------------
[...truncated 9.89 KB...]
checking whether C compiler handles -Wfree-nonheap-object... yes
checking whether C compiler handles -Wignored-qualifiers... yes
checking whether C compiler handles -Wimplicit... yes
checking whether C compiler handles -Wimplicit-function-declaration... yes
checking whether C compiler handles -Wimplicit-int... yes
checking whether C compiler handles -Winit-self... yes
checking whether C compiler handles -Winline... yes
checking whether C compiler handles -Wint-to-pointer-cast... yes
checking whether C compiler handles -Winvalid-memory-model... yes
checking whether C compiler handles -Winvalid-pch... yes
checking whether C compiler handles -Wjump-misses-init... yes
checking whether C compiler handles -Wlogical-op... yes
checking whether C compiler handles -Wmain... yes
checking whether C compiler handles -Wmaybe-uninitialized... yes
checking whether C compiler handles -Wmissing-braces... yes
checking whether C compiler handles -Wmissing-declarations... yes
checking whether C compiler handles -Wmissing-field-initializers... yes
checking whether C compiler handles -Wmissing-include-dirs... yes
checking whether C compiler handles -Wmissing-parameter-type... yes
checking whether C compiler handles -Wmissing-prototypes... yes
checking whether C compiler handles -Wmultichar... yes
checking whether C compiler handles -Wnarrowing... yes
checking whether C compiler handles -Wnested-externs... yes
checking whether C compiler handles -Wnonnull... yes
checking whether C compiler handles -Wold-style-declaration... yes
checking whether C compiler handles -Wold-style-definition... yes
checking whether C compiler handles -Wopenmp-simd... yes
checking whether C compiler handles -Woverflow... yes
checking whether C compiler handles -Woverlength-strings... yes
checking whether C compiler handles -Woverride-init... yes
checking whether C compiler handles -Wpacked... yes
checking whether C compiler handles -Wpacked-bitfield-compat... yes
checking whether C compiler handles -Wparentheses... yes
checking whether C compiler handles -Wpointer-arith... yes
checking whether C compiler handles -Wpointer-sign... yes
checking whether C compiler handles -Wpointer-to-int-cast... yes
checking whether C compiler handles -Wpragmas... yes
checking whether C compiler handles -Wreturn-local-addr... yes
checking whether C compiler handles -Wreturn-type... yes
checking whether C compiler handles -Wsequence-point... yes
checking whether C compiler handles -Wshadow... yes
checking whether C compiler handles -Wsizeof-pointer-memaccess... yes
checking whether C compiler handles -Wstack-protector... yes
checking whether C compiler handles -Wstrict-aliasing... yes
checking whether C compiler handles -Wstrict-overflow... yes
checking whether C compiler handles -Wstrict-prototypes... yes
checking whether C compiler handles -Wsuggest-attribute=const... yes
checking whether C compiler handles -Wsuggest-attribute=format... yes
checking whether C compiler handles -Wsuggest-attribute=noreturn... yes
checking whether C compiler handles -Wsuggest-attribute=pure... yes
checking whether C compiler handles -Wswitch... yes
checking whether C compiler handles -Wswitch-default... yes
checking whether C compiler handles -Wsync-nand... yes
checking whether C compiler handles -Wtrampolines... yes
checking whether C compiler handles -Wtrigraphs... yes
checking whether C compiler handles -Wtype-limits... yes
checking whether C compiler handles -Wuninitialized... yes
checking whether C compiler handles -Wunknown-pragmas... yes
checking whether C compiler handles -Wunsafe-loop-optimizations... yes
checking whether C compiler handles -Wunused... yes
checking whether C compiler handles -Wunused-but-set-parameter... yes
checking whether C compiler handles -Wunused-but-set-variable... yes
checking whether C compiler handles -Wunused-function... yes
checking whether C compiler handles -Wunused-label... yes
checking whether C compiler handles -Wunused-local-typedefs... yes
checking whether C compiler handles -Wunused-parameter... yes
checking whether C compiler handles -Wunused-result... yes
checking whether C compiler handles -Wunused-value... yes
checking whether C compiler handles -Wunused-variable... yes
checking whether C compiler handles -Wvarargs... yes
checking whether C compiler handles -Wvariadic-macros... yes
checking whether C compiler handles -Wvector-operation-performance... yes
checking whether C compiler handles -Wvla... yes
checking whether C compiler handles -Wvolatile-register-var... yes
checking whether C compiler handles -Wwrite-strings... yes
checking whether C compiler handles -Wnormalized=nfc... yes
checking whether C compiler handles -Wno-sign-compare... yes
checking whether C compiler handles -Wno-sign-conversion... yes
checking whether C compiler handles -Wno-conversion... yes
checking whether C compiler handles -Wno-unused-parameter... yes
checking whether C compiler handles -Wno-format-nonliteral... yes
checking whether C compiler handles -Wno-cast-function-type... yes
checking whether C compiler handles -Wjump-misses-init... (cached) yes
checking whether C compiler handles -Wframe-larger-than=4096... yes
checking whether C compiler handles -fstack-protector-all... yes
checking whether C compiler handles --param=ssp-buffer-size=4... yes
checking whether C compiler handles -fexceptions... yes
checking whether C compiler handles -fasynchronous-unwind-tables... yes
checking whether C compiler handles -fdiagnostics-show-option... yes
checking whether C compiler handles -funit-at-a-time... yes
checking whether C compiler handles -fipa-pure-const... yes
checking whether C compiler handles -Wno-suggest-attribute=pure... yes
checking whether C compiler handles -Wno-suggest-attribute=const... yes
checking whether C compiler handles -Werror... yes
checking for pkg-config... /usr/bin/pkg-config
checking pkg-config is at least version 0.9.0... yes
checking for GIO_UNIX... yes
checking for GOBJECT... yes
checking for LIBVIRT... yes
checking for LIBVIRT_GLIB... yes
checking for LIBVIRT_GOBJECT... yes
checking for LIBVIRT_GCONFIG... yes
checking for ZLIB... yes
checking for LZMA... yes
checking cap-ng.h usability... yes
checking cap-ng.h presence... yes
checking for cap-ng.h... yes
checking for capng_updatev in -lcap-ng... yes
checking for gtk-doc... yes
checking for gtkdoc-check... gtkdoc-check.test
checking for gtkdoc-check... /usr/bin/gtkdoc-check
checking for gtkdoc-rebase... /usr/bin/gtkdoc-rebase
checking for gtkdoc-mkpdf... /usr/bin/gtkdoc-mkpdf
checking whether to build gtk-doc documentation... yes
checking for GTKDOC_DEPS... yes
checking for perl... /usr/bin/perl
checking for rpcgen... /usr/bin/rpcgen
checking selinux/selinux.h usability... yes
checking selinux/selinux.h presence... yes
checking for selinux/selinux.h... yes
checking for fgetfilecon in -lselinux... yes
checking for library containing xdrmem_create... -ltirpc
checking where to find <rpc/rpc.h>... -I/usr/include/tirpc
checking for static LIBC... yes
checking for static LZMA... yes
checking for static ZLIB... yes
checking for ldd... /usr/bin/ldd
checking for gobject-introspection... yes
checking whether NLS is requested... yes
checking for intltool >= 0.35.0... 0.51.0 found
checking for intltool-update... /usr/bin/intltool-update
checking for intltool-merge... /usr/bin/intltool-merge
checking for intltool-extract... /usr/bin/intltool-extract
checking for xgettext... /usr/bin/xgettext
checking for msgmerge... /usr/bin/msgmerge
checking for msgfmt... /usr/bin/msgfmt
checking for gmsgfmt... /usr/bin/msgfmt
checking for perl... /usr/bin/perl
checking for perl >= 5.8.1... 5.28.0
checking for XML::Parser... ok
checking that generated files are newer than configure... done
configure: creating ./config.status
config.status: creating Makefile
config.status: creating libvirt-sandbox/Makefile
config.status: creating libvirt-sandbox/tests/Makefile
config.status: creating bin/Makefile
config.status: creating examples/Makefile
config.status: creating docs/Makefile
config.status: creating docs/libvirt-sandbox/Makefile
config.status: creating po/Makefile.in
config.status: creating libvirt-sandbox.spec
config.status: creating libvirt-sandbox-1.0.pc
config.status: creating config.h
config.status: linking ../GNUmakefile to GNUmakefile
config.status: executing depfiles commands
config.status: executing libtool commands
config.status: executing po/stamp-it commands
configure: 
configure: Configuration summary
configure: =====================
configure: 
configure: 
configure:  Libraries:
configure: 
configure:             LZMA:  -llzma -pthread 
configure:             ZLIB:  -lz 
configure:          GOBJECT: -I/usr/include/glib-2.0 -I/usr/lib64/glib-2.0/include  -lgobject-2.0 -lglib-2.0 
configure:  LIBVIRT_GOBJECT: -I/home/jenkins/build/libvirt/include/libvirt-gobject-1.0 -I/usr/include/glib-2.0 -I/usr/lib64/glib-2.0/include -I/home/jenkins/build/libvirt/include/libvirt-gconfig-1.0 -I/usr/include/libxml2 -pthread  -L/home/jenkins/build/libvirt/lib -lvirt-gobject-1.0 -lgio-2.0 -lvirt-gconfig-1.0 -lgobject-2.0 -lglib-2.0 -lxml2 -lvirt 
configure: 

Now type 'make' to compile libvirt-sandbox.
+ /usr/bin/gmake
/usr/bin/gmake  all-recursive
gmake[1]: Entering directory '<https://ci.centos.org/job/libvirt-sandbox-master-build/systems=libvirt-fedora-rawhide/ws/build'>
Making all in libvirt-sandbox
gmake[2]: Entering directory '<https://ci.centos.org/job/libvirt-sandbox-master-build/systems=libvirt-fedora-rawhide/ws/build/libvirt-sandbox'>
  GEN      libvirt-sandbox-enum-types.h
  GEN      libvirt-sandbox-enum-types.c
  GEN      libvirt-sandbox-protocol.h
  GEN      libvirt-sandbox-protocol.c
/usr/bin/gmake  all-recursive
gmake[3]: Entering directory '<https://ci.centos.org/job/libvirt-sandbox-master-build/systems=libvirt-fedora-rawhide/ws/build/libvirt-sandbox'>
Making all in tests
gmake[4]: Entering directory '<https://ci.centos.org/job/libvirt-sandbox-master-build/systems=libvirt-fedora-rawhide/ws/build/libvirt-sandbox/tests'>
gmake[4]: Nothing to be done for 'all'.
gmake[4]: Leaving directory '<https://ci.centos.org/job/libvirt-sandbox-master-build/systems=libvirt-fedora-rawhide/ws/build/libvirt-sandbox/tests'>
gmake[4]: Entering directory '<https://ci.centos.org/job/libvirt-sandbox-master-build/systems=libvirt-fedora-rawhide/ws/build/libvirt-sandbox'>
  CC       libvirt_sandbox_init_common-libvirt-sandbox-init-common.o
  CC       libvirt_sandbox_init_common-libvirt-sandbox-protocol.o
  CC       libvirt_sandbox_init_common-libvirt-sandbox-rpcpacket.o
  CC       libvirt_sandbox_init_common-libvirt-sandbox-util.o
  CC       libvirt_sandbox_init_common-libvirt-sandbox-config.o
  CC       libvirt_sandbox_init_common-libvirt-sandbox-config-disk.o
  CC       libvirt_sandbox_init_common-libvirt-sandbox-config-network.o
../../libvirt-sandbox/libvirt-sandbox-config-disk.c: In function ‘gvir_sandbox_config_disk_class_init’:
../../libvirt-sandbox/libvirt-sandbox-config-disk.c:198:5: error: ‘g_type_class_add_private’ is deprecated [-Werror=deprecated-declarations]
     g_type_class_add_private(klass, sizeof(GVirSandboxConfigDiskPrivate));
     ^~~~~~~~~~~~~~~~~~~~~~~~
In file included from /usr/include/glib-2.0/gobject/gobject.h:24,
                 from /usr/include/glib-2.0/gobject/gbinding.h:29,
                 from /usr/include/glib-2.0/glib-object.h:23,
                 from /home/jenkins/build/libvirt/include/libvirt-gconfig-1.0/libvirt-gconfig/libvirt-gconfig.h:26,
                 from ../../libvirt-sandbox/libvirt-sandbox-config-all.h:27,
                 from ../../libvirt-sandbox/libvirt-sandbox-config-disk.c:26:
/usr/include/glib-2.0/gobject/gtype.h:1303:10: note: declared here
 void     g_type_class_add_private       (gpointer                    g_class,
          ^~~~~~~~~~~~~~~~~~~~~~~~
cc1: all warnings being treated as errors
gmake[4]: *** [Makefile:1413: libvirt_sandbox_init_common-libvirt-sandbox-config-disk.o] Error 1
gmake[4]: *** Waiting for unfinished jobs....
../../libvirt-sandbox/libvirt-sandbox-config-network.c: In function ‘gvir_sandbox_config_network_class_init’:
../../libvirt-sandbox/libvirt-sandbox-config-network.c:187:5: error: ‘g_type_class_add_private’ is deprecated [-Werror=deprecated-declarations]
     g_type_class_add_private(klass, sizeof(GVirSandboxConfigNetworkPrivate));
     ^~~~~~~~~~~~~~~~~~~~~~~~
In file included from /usr/include/glib-2.0/gobject/gobject.h:24,
                 from /usr/include/glib-2.0/gobject/gbinding.h:29,
                 from /usr/include/glib-2.0/glib-object.h:23,
                 from /home/jenkins/build/libvirt/include/libvirt-gconfig-1.0/libvirt-gconfig/libvirt-gconfig.h:26,
                 from ../../libvirt-sandbox/libvirt-sandbox-config-all.h:27,
                 from ../../libvirt-sandbox/libvirt-sandbox-config-network.c:26:
/usr/include/glib-2.0/gobject/gtype.h:1303:10: note: declared here
 void     g_type_class_add_private       (gpointer                    g_class,
          ^~~~~~~~~~~~~~~~~~~~~~~~
cc1: all warnings being treated as errors
gmake[4]: *** [Makefile:1427: libvirt_sandbox_init_common-libvirt-sandbox-config-network.o] Error 1
../../libvirt-sandbox/libvirt-sandbox-config.c: In function ‘gvir_sandbox_config_class_init’:
../../libvirt-sandbox/libvirt-sandbox-config.c:474:5: error: ‘g_type_class_add_private’ is deprecated [-Werror=deprecated-declarations]
     g_type_class_add_private(klass, sizeof(GVirSandboxConfigPrivate));
     ^~~~~~~~~~~~~~~~~~~~~~~~
In file included from /usr/include/glib-2.0/gobject/gobject.h:24,
                 from /usr/include/glib-2.0/gobject/gbinding.h:29,
                 from /usr/include/glib-2.0/glib-object.h:23,
                 from /home/jenkins/build/libvirt/include/libvirt-gconfig-1.0/libvirt-gconfig/libvirt-gconfig.h:26,
                 from ../../libvirt-sandbox/libvirt-sandbox-config-all.h:27,
                 from ../../libvirt-sandbox/libvirt-sandbox-config.c:29:
/usr/include/glib-2.0/gobject/gtype.h:1303:10: note: declared here
 void     g_type_class_add_private       (gpointer                    g_class,
          ^~~~~~~~~~~~~~~~~~~~~~~~
cc1: all warnings being treated as errors
gmake[4]: *** [Makefile:1399: libvirt_sandbox_init_common-libvirt-sandbox-config.o] Error 1
gmake[4]: Leaving directory '<https://ci.centos.org/job/libvirt-sandbox-master-build/systems=libvirt-fedora-rawhide/ws/build/libvirt-sandbox'>
gmake[3]: *** [Makefile:1796: all-recursive] Error 1
gmake[3]: Leaving directory '<https://ci.centos.org/job/libvirt-sandbox-master-build/systems=libvirt-fedora-rawhide/ws/build/libvirt-sandbox'>
gmake[2]: *** [Makefile:887: all] Error 2
gmake[2]: Leaving directory '<https://ci.centos.org/job/libvirt-sandbox-master-build/systems=libvirt-fedora-rawhide/ws/build/libvirt-sandbox'>
gmake[1]: *** [Makefile:556: all-recursive] Error 1
gmake[1]: Leaving directory '<https://ci.centos.org/job/libvirt-sandbox-master-build/systems=libvirt-fedora-rawhide/ws/build'>
gmake: *** [Makefile:463: all] Error 2
Build step 'Execute shell' marked build as failure


[Date Prev][Date Next]   [Thread Prev][Thread Next]   [Thread Index] [Date Index] [Author Index]