[Date Prev][Date Next]   [Thread Prev][Thread Next]   [Thread Index] [Date Index] [Author Index]

[Libvirt-ci] Build failed in Jenkins: libvirt-master- check » libvirt-freebsd-11 #1335



See <https://ci.centos.org/job/libvirt-master-check/systems=libvirt-freebsd-11/1335/display/redirect>

------------------------------------------
[...truncated 24.46 KB...]
PASS: virrotatingfiletest
PASS: viratomictest
PASS: virstringtest
SKIP: virportallocatortest
PASS: sysinfotest
SKIP: virkmodtest
PASS: vircapstest
PASS: domaincapstest
PASS: domainconftest
SKIP: virhostdevtest
SKIP: virnetdevtest
PASS: virtypedparamtest
FAIL: vshtabletest
PASS: virnetmessagetest
PASS: virschematest
PASS: virnetdaemontest
PASS: virnetsockettest
PASS: virnetserverclienttest
SKIP: virnettlscontexttest
SKIP: virnettlssessiontest
PASS: virdbustest
PASS: fdstreamtest
SKIP: virsystemdtest
PASS: virpolkittest
PASS: qemuxml2xmltest
PASS: qemuargv2xmltest
PASS: domainsnapshotxml2xmltest
PASS: qemuxml2argvtest
PASS: qemumonitorjsontest
PASS: qemuagenttest
PASS: qemuhotplugtest
PASS: qemucaps2xmltest
PASS: qemumemlocktest
PASS: qemucommandutiltest
PASS: qemublocktest
PASS: qemumigparamstest
PASS: esxutilstest
PASS: vboxsnapshotxmltest
PASS: vmx2xmltest
PASS: xml2vmxtest
PASS: vmwarevertest
PASS: bhyvexml2argvtest
PASS: bhyvexml2xmltest
PASS: bhyveargv2xmltest
PASS: qemucapabilitiestest
PASS: virjsontest
PASS: networkxml2xmlupdatetest
PASS: networkxml2xmltest
PASS: networkxml2conftest
SKIP: networkxml2firewalltest
PASS: virnwfilterbindingxml2xmltest
PASS: nwfilterxml2xmltest
PASS: storagevolxml2argvtest
PASS: virstorageutiltest
PASS: nsstest
PASS: nssguesttest
PASS: storagevolxml2xmltest
PASS: nodedevxml2xmltest
PASS: storagepoolxml2xmltest
PASS: interfacexml2xmltest
PASS: metadatatest
PASS: secretxml2xmltest
PASS: genericxml2xmltest
PASS: eventtest
PASS: virdrivermoduletest
PASS: objecteventtest
PASS: virmacmaptest
PASS: cputest
PASS: libvirtd-fail
PASS: libvirtd-pool
PASS: virsh-cpuset
PASS: virsh-int-overflow
PASS: virsh-define-dev-segfault
SKIP: virsh-optparse
PASS: virsh-read-bufsiz
PASS: virsh-read-non-seekable
PASS: virsh-schedinfo
PASS: virsh-self-test
PASS: virt-admin-self-test
PASS: virsh-start
PASS: virsh-undefine
PASS: virsh-uriprecedence
PASS: virsh-vcpupin
PASS: virshtest
============================================================================
Testsuite summary for libvirt 4.7.0
============================================================================
# TOTAL: 110
# PASS:  95
# SKIP:  14
# XFAIL: 0
# FAIL:  1
# XPASS: 0
# ERROR: 0
============================================================================
See tests/test-suite.log
Please report to libvir-list redhat com
============================================================================
gmake[3]: *** [Makefile:5838: test-suite.log] Error 1
gmake[3]: Leaving directory '/usr<https://ci.centos.org/job/libvirt-master-check/systems=libvirt-freebsd-11/ws/build/tests'>
gmake[2]: *** [Makefile:5946: check-TESTS] Error 2
gmake[2]: Leaving directory '/usr<https://ci.centos.org/job/libvirt-master-check/systems=libvirt-freebsd-11/ws/build/tests'>
gmake[1]: *** [Makefile:6951: check-am] Error 2
gmake[1]: Leaving directory '/usr<https://ci.centos.org/job/libvirt-master-check/systems=libvirt-freebsd-11/ws/build/tests'>
gmake: *** [Makefile:2108: check-recursive] Error 1
+ cat tests/test-suite.log
=========================================
   libvirt 4.7.0: tests/test-suite.log
=========================================

# TOTAL: 110
# PASS:  95
# SKIP:  14
# XFAIL: 0
# FAIL:  1
# XPASS: 0
# ERROR: 0

.. contents:: :depth: 2

SKIP: virhostcputest
====================

SKIP virhostcputest (exit status: 77)

SKIP: shunloadtest
==================

SKIP shunloadtest (exit status: 77)

SKIP: vircgrouptest
===================

SKIP vircgrouptest (exit status: 77)

SKIP: virpcitest
================

SKIP virpcitest (exit status: 77)

SKIP: virfirewalltest
=====================

SKIP virfirewalltest (exit status: 77)

SKIP: virportallocatortest
==========================

SKIP virportallocatortest (exit status: 77)

SKIP: virkmodtest
=================

SKIP virkmodtest (exit status: 77)

SKIP: virhostdevtest
====================

SKIP virhostdevtest (exit status: 77)

SKIP: virnetdevtest
===================

SKIP virnetdevtest (exit status: 77)

FAIL: vshtabletest
==================

TEST: vshtabletest
 1) testVshTableNew                                                   ... libvirt:  error : internal error: Table row cannot be empty
OK
 2) testVshTableHeader                                                ... OK
 3) testVshTableRowAppend                                             ... libvirt:  error : internal error: Incorrect number of cells in a table row
OK
 4) testUnicode                                                       ... 
Offset 0
Expect [ Id   ������                  ����������������������  
-----------------------------------------
 1    fedora28              running      
 2    ������������rhel7.5������������   running      
]
Actual [ Id   ������            ����������������������  
-----------------------------------
 1    fedora28        running      
 2    ������������rhel7.5������������   running      
]
                                                                      ... FAILED
 5) testUnicodeArabic                                                 ... 
Offset 0
Expect [ ������ ��������� ���������������   ��� ������������                                                 ������������������              
-------------------------------------------------------------------------------------------
 1              ������������ ������������������ ��������� ������, ���� ��������������� ������������������ �������������������� ���������, ���������   ���������. ������������ ��� ������ ���������  
 ������������           �������������������� ������, ������������������ ���������������������                              ������                  
]
Actual [ ������ ��������� ���������������   ��� ������������                                                        ������������������              
--------------------------------------------------------------------------------------------------
 1              ������������ ������������������ ��������� ������, ���� ��������������� ������������������ ������������������\xff\xff ���������, ���������   ���������. ������������ ��� ������ ���������  
 ������������           �������������������� ������, ������������������ ���������������������                                     ������                  
]
                                                                      ... FAILED
 6) testUnicodeZeroWidthChar                                          ... 
Offset 0
Expect [ I���d   Name       ���Status   
--------------------------
 1���    fedora28   run���ning  
 2    rhel7.5    running  
]
Actual [ I\xff\xff\xffd   Name       \xff\xff\xffStatus   
--------------------------------------------------
 1\xff\xff\xff    fedora28   run\xff\xff\xffning  
 2                rhel7.5    running              
]
                                                                      ... FAILED
 7) testUnicodeCombiningChar                                          ... OK
 8) testUnicodeNonPrintableChar                                       ... OK
 9) testNTables                                                       ... OK
FAIL vshtabletest (exit status: 1)

SKIP: virnettlscontexttest
==========================

SKIP virnettlscontexttest (exit status: 77)

SKIP: virnettlssessiontest
==========================

SKIP virnettlssessiontest (exit status: 77)

SKIP: virsystemdtest
====================

SKIP virsystemdtest (exit status: 77)

SKIP: networkxml2firewalltest
=============================

SKIP networkxml2firewalltest (exit status: 77)

SKIP: virsh-optparse
====================

../../tests/virsh-optparse: skipping test: 
This test is very expensive, so it is disabled by default.
To run it anyway, rerun: make check VIR_TEST_EXPENSIVE=1

SKIP virsh-optparse (exit status: 77)

+ exit 1
Build step 'Execute shell' marked build as failure


[Date Prev][Date Next]   [Thread Prev][Thread Next]   [Thread Index] [Date Index] [Author Index]