[Date Prev][Date Next]   [Thread Prev][Thread Next]   [Thread Index] [Date Index] [Author Index]

[Libvirt-ci] Build failed in Jenkins: libvirt-master- check » libvirt-debian-8 #1337



See <https://ci.centos.org/job/libvirt-master-check/systems=libvirt-debian-8/1337/display/redirect>

------------------------------------------
[...truncated 26.63 KB...]
SKIP: test-wcrtomb-w32-4.sh
SKIP: test-wcrtomb-w32-5.sh
PASS: test-wctype-h
PASS: test-wcwidth
PASS: test-write
PASS: test-xalloc-die.sh
PASS: test-usleep
PASS: test-verify.sh
make[6]: Entering directory '<https://ci.centos.org/job/libvirt-master-check/systems=libvirt-debian-8/ws/build/gnulib/tests'>
/usr/bin/make  all-recursive
make[7]: Entering directory '<https://ci.centos.org/job/libvirt-master-check/systems=libvirt-debian-8/ws/build/gnulib/tests'>
Making all in .
make[8]: Entering directory '<https://ci.centos.org/job/libvirt-master-check/systems=libvirt-debian-8/ws/build/gnulib/tests'>
make[8]: Nothing to be done for 'all-am'.
make[8]: Leaving directory '<https://ci.centos.org/job/libvirt-master-check/systems=libvirt-debian-8/ws/build/gnulib/tests'>
make[7]: Leaving directory '<https://ci.centos.org/job/libvirt-master-check/systems=libvirt-debian-8/ws/build/gnulib/tests'>
make[6]: Leaving directory '<https://ci.centos.org/job/libvirt-master-check/systems=libvirt-debian-8/ws/build/gnulib/tests'>
============================================================================
Testsuite summary for libvirt 4.7.0
============================================================================
# TOTAL: 219
# PASS:  193
# SKIP:  26
# XFAIL: 0
# FAIL:  0
# XPASS: 0
# ERROR: 0
============================================================================
make[5]: Leaving directory '<https://ci.centos.org/job/libvirt-master-check/systems=libvirt-debian-8/ws/build/gnulib/tests'>
make[4]: Leaving directory '<https://ci.centos.org/job/libvirt-master-check/systems=libvirt-debian-8/ws/build/gnulib/tests'>
make[3]: Leaving directory '<https://ci.centos.org/job/libvirt-master-check/systems=libvirt-debian-8/ws/build/gnulib/tests'>
make[2]: Leaving directory '<https://ci.centos.org/job/libvirt-master-check/systems=libvirt-debian-8/ws/build/gnulib/tests'>
make[1]: Leaving directory '<https://ci.centos.org/job/libvirt-master-check/systems=libvirt-debian-8/ws/build/gnulib/tests'>
Making check in tests
make[1]: Entering directory '<https://ci.centos.org/job/libvirt-master-check/systems=libvirt-debian-8/ws/build/tests'>
/usr/bin/make   
make[2]: Entering directory '<https://ci.centos.org/job/libvirt-master-check/systems=libvirt-debian-8/ws/build/tests'>
make[2]: Nothing to be done for 'all'.
make[2]: Leaving directory '<https://ci.centos.org/job/libvirt-master-check/systems=libvirt-debian-8/ws/build/tests'>
/usr/bin/make  check-TESTS
make[2]: Entering directory '<https://ci.centos.org/job/libvirt-master-check/systems=libvirt-debian-8/ws/build/tests'>
make[3]: Entering directory '<https://ci.centos.org/job/libvirt-master-check/systems=libvirt-debian-8/ws/build/tests'>
PASS: sockettest
PASS: virhostcputest
PASS: virbuftest
PASS: seclabeltest
PASS: virhashtest
PASS: commandtest
PASS: virconftest
PASS: utiltest
PASS: shunloadtest
PASS: viratomictest
PASS: viruritest
PASS: virtimetest
PASS: virkeyfiletest
PASS: viralloctest
PASS: virauthconfigtest
PASS: virbitmaptest
PASS: vircgrouptest
PASS: vircryptotest
PASS: virpcitest
PASS: virendiantest
PASS: virfilecachetest
PASS: virfiletest
PASS: virfirewalltest
PASS: viriscsitest
PASS: virkeycodetest
PASS: virlockspacetest
PASS: virrotatingfiletest
PASS: virlogtest
PASS: virstringtest
PASS: virportallocatortest
PASS: sysinfotest
PASS: virshtest
PASS: virkmodtest
PASS: vircapstest
PASS: domainconftest
PASS: domaincapstest
PASS: virhostdevtest
PASS: virnetdevtest
PASS: virtypedparamtest
FAIL: vshtabletest
PASS: virnetmessagetest
PASS: virnetsockettest
PASS: virnetdaemontest
PASS: virschematest
PASS: virnetserverclienttest
PASS: fchosttest
PASS: virnettlscontexttest
PASS: scsihosttest
PASS: vircaps2xmltest
PASS: virnettlssessiontest
PASS: virresctrltest
PASS: virdbustest
PASS: fdstreamtest
PASS: virsystemdtest
PASS: virpolkittest
PASS: securityselinuxtest
PASS: viridentitytest
PASS: xlconfigtest
PASS: securityselinuxlabeltest
PASS: sexpr2xmltest
PASS: xml2sexprtest
PASS: xmconfigtest
SKIP: libxlxml2domconfigtest
PASS: qemuargv2xmltest
PASS: domainsnapshotxml2xmltest
PASS: qemuxml2xmltest
PASS: qemumonitorjsontest
PASS: qemuxml2argvtest
PASS: qemuhotplugtest
PASS: qemucaps2xmltest
PASS: qemumemlocktest
PASS: qemucommandutiltest
PASS: qemucapabilitiestest
PASS: qemumigparamstest
PASS: qemublocktest
PASS: lxcxml2xmltest
PASS: lxcconf2xmltest
PASS: openvzutilstest
PASS: esxutilstest
PASS: qemuagenttest
PASS: vboxsnapshotxmltest
PASS: vmx2xmltest
PASS: xml2vmxtest
PASS: vmwarevertest
PASS: networkxml2xmltest
PASS: virjsontest
PASS: networkxml2xmlupdatetest
PASS: networkxml2conftest
PASS: networkxml2firewalltest
PASS: storagebackendsheepdogtest
PASS: virnwfilterbindingxml2xmltest
PASS: nwfilterxml2xmltest
PASS: nwfilterebiptablestest
PASS: nwfilterxml2firewalltest
PASS: virstorageutiltest
PASS: storagevolxml2argvtest
PASS: virscsitest
PASS: nsstest
PASS: nssguesttest
PASS: storagevolxml2xmltest
PASS: storagepoolxml2xmltest
PASS: nodedevxml2xmltest
PASS: interfacexml2xmltest
PASS: metadatatest
PASS: secretxml2xmltest
PASS: virstoragetest
PASS: genericxml2xmltest
PASS: virusbtest
PASS: virnetdevbandwidthtest
PASS: eventtest
PASS: virdrivermoduletest
PASS: cputest
PASS: objecteventtest
PASS: virmacmaptest
PASS: libvirtd-pool
PASS: virsh-define-dev-segfault
PASS: libvirtd-fail
PASS: virsh-cpuset
PASS: virsh-int-overflow
PASS: virsh-read-non-seekable
PASS: virsh-read-bufsiz
PASS: virsh-schedinfo
PASS: virsh-self-test
PASS: virsh-start
PASS: virt-admin-self-test
PASS: virsh-undefine
PASS: virsh-uriprecedence
PASS: virsh-vcpupin
PASS: virsh-optparse
PASS: virt-aa-helper-test
make[4]: Entering directory '<https://ci.centos.org/job/libvirt-master-check/systems=libvirt-debian-8/ws/build/tests'>
make[4]: Nothing to be done for 'all'.
make[4]: Leaving directory '<https://ci.centos.org/job/libvirt-master-check/systems=libvirt-debian-8/ws/build/tests'>
============================================================================
Testsuite summary for libvirt 4.7.0
============================================================================
# TOTAL: 130
# PASS:  128
# SKIP:  1
# XFAIL: 0
# FAIL:  1
# XPASS: 0
# ERROR: 0
============================================================================
See tests/test-suite.log
Please report to libvir-list redhat com
============================================================================
Makefile:5706: recipe for target 'test-suite.log' failed
make[3]: *** [test-suite.log] Error 1
make[3]: Leaving directory '<https://ci.centos.org/job/libvirt-master-check/systems=libvirt-debian-8/ws/build/tests'>
Makefile:5812: recipe for target 'check-TESTS' failed
make[2]: *** [check-TESTS] Error 2
make[2]: Leaving directory '<https://ci.centos.org/job/libvirt-master-check/systems=libvirt-debian-8/ws/build/tests'>
Makefile:6816: recipe for target 'check-am' failed
make[1]: *** [check-am] Error 2
make[1]: Leaving directory '<https://ci.centos.org/job/libvirt-master-check/systems=libvirt-debian-8/ws/build/tests'>
Makefile:2100: recipe for target 'check-recursive' failed
make: *** [check-recursive] Error 1
+ cat tests/test-suite.log
=========================================
   libvirt 4.7.0: tests/test-suite.log
=========================================

# TOTAL: 130
# PASS:  128
# SKIP:  1
# XFAIL: 0
# FAIL:  1
# XPASS: 0
# ERROR: 0

.. contents:: :depth: 2

FAIL: vshtabletest
==================

TEST: vshtabletest
 1) testVshTableNew                                                   ... libvirt:  error : internal error: Table row cannot be empty
OK
 2) testVshTableHeader                                                ... OK
 3) testVshTableRowAppend                                             ... libvirt:  error : internal error: Incorrect number of cells in a table row
OK
 4) testUnicode                                                       ... 
Offset 0
Expect [ Id   名稱                  государство  
-----------------------------------------
 1    fedora28              running      
 2    🙊🙉🙈rhel7.5🙆🙆🙅   running      
]
Actual [ Id   名稱                                                                                                      государство  
-----------------------------------------------------------------------------------------------------------------------------
 1    fedora28                                                                                                  running      
 2    \xff\xff\xff\xff\xff\xff\xff\xff\xff\xff\xff\xffrhel7.5\xff\xff\xff\xff\xff\xff\xff\xff\xff\xff\xff\xff   running      
]
                                                                      ... FAILED
 5) testUnicodeArabic                                                 ... OK
 6) testUnicodeZeroWidthChar                                          ... OK
 7) testUnicodeCombiningChar                                          ... OK
 8) testUnicodeNonPrintableChar                                       ... OK
 9) testNTables                                                       ... OK

SKIP: libxlxml2domconfigtest
============================


+ exit 1
Build step 'Execute shell' marked build as failure


[Date Prev][Date Next]   [Thread Prev][Thread Next]   [Thread Index] [Date Index] [Author Index]