[Date Prev][Date Next]   [Thread Prev][Thread Next]   [Thread Index] [Date Index] [Author Index]

[Libvirt-ci] Build failed in Jenkins: libvirt-master- check » libvirt-centos-7 #1343



See <https://ci.centos.org/job/libvirt-master-check/systems=libvirt-centos-7/1343/display/redirect>

------------------------------------------
[...truncated 27.46 KB...]
PASS: test-unlockpt
PASS: test-unsetenv
PASS: test-init.sh
PASS: uniwidth/test-uc_width2.sh
PASS: test-vasnprintf
PASS: test-vasprintf
PASS: test-vc-list-files-git.sh
SKIP: test-vc-list-files-cvs.sh
PASS: test-verify
PASS: test-vsnprintf
PASS: test-wchar
PASS: test-usleep
SKIP: test-wcrtomb-w32-1.sh
SKIP: test-wcrtomb-w32-2.sh
SKIP: test-wcrtomb-w32-3.sh
PASS: test-wcrtomb.sh
SKIP: test-wcrtomb-w32-4.sh
SKIP: test-wcrtomb-w32-5.sh
PASS: test-wctype-h
PASS: test-wcwidth
PASS: test-write
PASS: test-xalloc-die.sh
PASS: test-verify.sh
gmake[6]: Entering directory `<https://ci.centos.org/job/libvirt-master-check/systems=libvirt-centos-7/ws/build/gnulib/tests'>
/usr/bin/gmake  all-recursive
gmake[7]: Entering directory `<https://ci.centos.org/job/libvirt-master-check/systems=libvirt-centos-7/ws/build/gnulib/tests'>
Making all in .
gmake[8]: Entering directory `<https://ci.centos.org/job/libvirt-master-check/systems=libvirt-centos-7/ws/build/gnulib/tests'>
gmake[8]: Nothing to be done for `all-am'.
gmake[8]: Leaving directory `<https://ci.centos.org/job/libvirt-master-check/systems=libvirt-centos-7/ws/build/gnulib/tests'>
gmake[7]: Leaving directory `<https://ci.centos.org/job/libvirt-master-check/systems=libvirt-centos-7/ws/build/gnulib/tests'>
gmake[6]: Leaving directory `<https://ci.centos.org/job/libvirt-master-check/systems=libvirt-centos-7/ws/build/gnulib/tests'>
============================================================================
Testsuite summary for libvirt 4.7.0
============================================================================
# TOTAL: 219
# PASS:  205
# SKIP:  14
# XFAIL: 0
# FAIL:  0
# XPASS: 0
# ERROR: 0
============================================================================
gmake[5]: Leaving directory `<https://ci.centos.org/job/libvirt-master-check/systems=libvirt-centos-7/ws/build/gnulib/tests'>
gmake[4]: Leaving directory `<https://ci.centos.org/job/libvirt-master-check/systems=libvirt-centos-7/ws/build/gnulib/tests'>
gmake[3]: Leaving directory `<https://ci.centos.org/job/libvirt-master-check/systems=libvirt-centos-7/ws/build/gnulib/tests'>
gmake[2]: Leaving directory `<https://ci.centos.org/job/libvirt-master-check/systems=libvirt-centos-7/ws/build/gnulib/tests'>
gmake[1]: Leaving directory `<https://ci.centos.org/job/libvirt-master-check/systems=libvirt-centos-7/ws/build/gnulib/tests'>
Making check in tests
gmake[1]: Entering directory `<https://ci.centos.org/job/libvirt-master-check/systems=libvirt-centos-7/ws/build/tests'>
/usr/bin/gmake   
gmake[2]: Entering directory `<https://ci.centos.org/job/libvirt-master-check/systems=libvirt-centos-7/ws/build/tests'>
gmake[2]: Nothing to be done for `all'.
gmake[2]: Leaving directory `<https://ci.centos.org/job/libvirt-master-check/systems=libvirt-centos-7/ws/build/tests'>
/usr/bin/gmake  check-TESTS
gmake[2]: Entering directory `<https://ci.centos.org/job/libvirt-master-check/systems=libvirt-centos-7/ws/build/tests'>
gmake[3]: Entering directory `<https://ci.centos.org/job/libvirt-master-check/systems=libvirt-centos-7/ws/build/tests'>
PASS: sockettest
PASS: virhostcputest
PASS: virbuftest
PASS: seclabeltest
PASS: commandtest
PASS: virhashtest
PASS: virconftest
PASS: viratomictest
PASS: shunloadtest
PASS: utiltest
PASS: virtimetest
PASS: viruritest
PASS: virkeyfiletest
PASS: viralloctest
PASS: virbitmaptest
PASS: virauthconfigtest
PASS: vircgrouptest
PASS: vircryptotest
PASS: virendiantest
PASS: virpcitest
PASS: virfilecachetest
PASS: virfiletest
PASS: viriscsitest
PASS: virfirewalltest
PASS: virlockspacetest
PASS: virkeycodetest
PASS: virlogtest
PASS: virrotatingfiletest
PASS: virshtest
PASS: virstringtest
PASS: virportallocatortest
PASS: sysinfotest
PASS: virkmodtest
PASS: vircapstest
PASS: domaincapstest
PASS: virhostdevtest
PASS: domainconftest
PASS: virnetdevtest
PASS: virtypedparamtest
PASS: virschematest
PASS: virnetmessagetest
FAIL: vshtabletest
PASS: virnetserverclienttest
PASS: virnetsockettest
PASS: virnetdaemontest
PASS: fchosttest
PASS: virnettlssessiontest
PASS: scsihosttest
PASS: virnettlscontexttest
PASS: vircaps2xmltest
PASS: fdstreamtest
PASS: virresctrltest
PASS: virdbustest
PASS: virpolkittest
PASS: virsystemdtest
PASS: securityselinuxtest
PASS: viridentitytest
PASS: securityselinuxlabeltest
PASS: qemuargv2xmltest
PASS: domainsnapshotxml2xmltest
PASS: qemuxml2xmltest
PASS: qemuxml2argvtest
PASS: qemumonitorjsontest
PASS: qemuhotplugtest
PASS: qemucaps2xmltest
PASS: qemumemlocktest
PASS: qemucapabilitiestest
PASS: qemucommandutiltest
PASS: qemuagenttest
PASS: lxcxml2xmltest
PASS: qemumigparamstest
PASS: qemublocktest
PASS: lxcconf2xmltest
PASS: openvzutilstest
PASS: esxutilstest
PASS: vboxsnapshotxmltest
PASS: vmx2xmltest
PASS: xml2vmxtest
PASS: vmwarevertest
PASS: virjsontest
PASS: networkxml2xmltest
PASS: networkxml2xmlupdatetest
PASS: networkxml2conftest
PASS: networkxml2firewalltest
PASS: nwfilterxml2xmltest
PASS: virnwfilterbindingxml2xmltest
PASS: nwfilterebiptablestest
PASS: nwfilterxml2firewalltest
PASS: virstorageutiltest
PASS: storagevolxml2argvtest
PASS: virscsitest
PASS: nsstest
PASS: storagevolxml2xmltest
PASS: nssguesttest
PASS: storagepoolxml2xmltest
PASS: nodedevxml2xmltest
PASS: interfacexml2xmltest
PASS: virstoragetest
PASS: metadatatest
PASS: secretxml2xmltest
PASS: genericxml2xmltest
PASS: cputest
PASS: virusbtest
PASS: virnetdevbandwidthtest
PASS: virdrivermoduletest
PASS: eventtest
PASS: objecteventtest
PASS: virmacmaptest
PASS: libvirtd-pool
PASS: libvirtd-fail
PASS: virsh-define-dev-segfault
PASS: virsh-cpuset
PASS: virsh-int-overflow
PASS: virsh-read-non-seekable
PASS: virsh-read-bufsiz
PASS: virsh-schedinfo
PASS: virsh-self-test
PASS: virsh-start
PASS: virt-admin-self-test
PASS: virsh-undefine
PASS: virsh-uriprecedence
PASS: virsh-vcpupin
PASS: virsh-optparse
gmake[4]: Entering directory `<https://ci.centos.org/job/libvirt-master-check/systems=libvirt-centos-7/ws/build/tests'>
gmake[4]: Nothing to be done for `all'.
gmake[4]: Leaving directory `<https://ci.centos.org/job/libvirt-master-check/systems=libvirt-centos-7/ws/build/tests'>
============================================================================
Testsuite summary for libvirt 4.7.0
============================================================================
# TOTAL: 123
# PASS:  122
# SKIP:  0
# XFAIL: 0
# FAIL:  1
# XPASS: 0
# ERROR: 0
============================================================================
See tests/test-suite.log
Please report to libvir-list redhat com
============================================================================
gmake[3]: *** [test-suite.log] Error 1
gmake[3]: Leaving directory `<https://ci.centos.org/job/libvirt-master-check/systems=libvirt-centos-7/ws/build/tests'>
gmake[2]: *** [check-TESTS] Error 2
gmake[2]: Leaving directory `<https://ci.centos.org/job/libvirt-master-check/systems=libvirt-centos-7/ws/build/tests'>
gmake[1]: *** [check-am] Error 2
gmake[1]: Leaving directory `<https://ci.centos.org/job/libvirt-master-check/systems=libvirt-centos-7/ws/build/tests'>
gmake: *** [check-recursive] Error 1
+ cat tests/test-suite.log
=========================================
   libvirt 4.7.0: tests/test-suite.log
=========================================

# TOTAL: 123
# PASS:  122
# SKIP:  0
# XFAIL: 0
# FAIL:  1
# XPASS: 0
# ERROR: 0

.. contents:: :depth: 2

FAIL: vshtabletest
==================

TEST: vshtabletest
 1) testVshTableNew                                                   ... libvirt:  error : internal error: Table row cannot be empty
OK
 2) testVshTableHeader                                                ... OK
 3) testVshTableRowAppend                                             ... libvirt:  error : internal error: Incorrect number of cells in a table row
OK
 4) testUnicode                                                       ... 
Offset 0
Expect [ Id   名稱                  государство  
-----------------------------------------
 1    fedora28              running      
 2    🙊🙉🙈rhel7.5🙆🙆🙅   running      
]
Actual [ Id   名稱                                                                                                      государство  
-----------------------------------------------------------------------------------------------------------------------------
 1    fedora28                                                                                                  running      
 2    \xff\xff\xff\xff\xff\xff\xff\xff\xff\xff\xff\xffrhel7.5\xff\xff\xff\xff\xff\xff\xff\xff\xff\xff\xff\xff   running      
]
                                                                      ... FAILED
 5) testUnicodeArabic                                                 ... OK
 6) testUnicodeZeroWidthChar                                          ... OK
 7) testUnicodeCombiningChar                                          ... OK
 8) testUnicodeNonPrintableChar                                       ... OK
 9) testNTables                                                       ... OK

+ exit 1
Build step 'Execute shell' marked build as failure


[Date Prev][Date Next]   [Thread Prev][Thread Next]   [Thread Index] [Date Index] [Author Index]