[Date Prev][Date Next]   [Thread Prev][Thread Next]   [Thread Index] [Date Index] [Author Index]

[Libvirt-ci] Build failed in Jenkins: libvirt-master- check » libvirt-freebsd-10 #1344



See <https://ci.centos.org/job/libvirt-master-check/systems=libvirt-freebsd-10/1344/display/redirect>

------------------------------------------
[...truncated 48.03 KB...]
PASS: virbuftest
PASS: seclabeltest
PASS: virhashtest
PASS: virconftest
PASS: commandtest
PASS: utiltest
SKIP: shunloadtest
PASS: virtimetest
PASS: viruritest
PASS: virkeyfiletest
PASS: viratomictest
PASS: viralloctest
PASS: virauthconfigtest
PASS: virbitmaptest
SKIP: vircgrouptest
SKIP: virpcitest
PASS: vircryptotest
PASS: virendiantest
PASS: virfiletest
PASS: virfilecachetest
SKIP: virfirewalltest
PASS: virkeycodetest
PASS: viriscsitest
PASS: virlockspacetest
PASS: virrotatingfiletest
PASS: virlogtest
PASS: virstringtest
SKIP: virportallocatortest
PASS: sysinfotest
SKIP: virkmodtest
PASS: vircapstest
PASS: domaincapstest
PASS: domainconftest
SKIP: virhostdevtest
SKIP: virnetdevtest
PASS: virtypedparamtest
FAIL: vshtabletest
PASS: virnetmessagetest
PASS: virnetsockettest
PASS: virnetdaemontest
PASS: virnetserverclienttest
SKIP: virnettlscontexttest
SKIP: virnettlssessiontest
PASS: fdstreamtest
PASS: virdbustest
SKIP: virsystemdtest
PASS: virpolkittest
PASS: qemuxml2argvtest
PASS: qemuxml2xmltest
PASS: qemuargv2xmltest
PASS: domainsnapshotxml2xmltest
PASS: virschematest
PASS: qemumonitorjsontest
PASS: qemuagenttest
PASS: qemuhotplugtest
PASS: qemucaps2xmltest
PASS: qemumemlocktest
PASS: qemucommandutiltest
PASS: qemublocktest
PASS: qemumigparamstest
PASS: esxutilstest
PASS: vboxsnapshotxmltest
PASS: vmx2xmltest
PASS: qemucapabilitiestest
PASS: vmwarevertest
PASS: xml2vmxtest
PASS: bhyvexml2argvtest
PASS: bhyvexml2xmltest
PASS: virjsontest
PASS: networkxml2xmltest
PASS: bhyveargv2xmltest
PASS: networkxml2xmlupdatetest
PASS: networkxml2conftest
SKIP: networkxml2firewalltest
PASS: virnwfilterbindingxml2xmltest
PASS: nwfilterxml2xmltest
PASS: storagevolxml2argvtest
PASS: nsstest
PASS: virstorageutiltest
PASS: nssguesttest
PASS: storagepoolxml2xmltest
PASS: storagevolxml2xmltest
PASS: nodedevxml2xmltest
PASS: interfacexml2xmltest
PASS: metadatatest
PASS: secretxml2xmltest
PASS: genericxml2xmltest
PASS: eventtest
PASS: virdrivermoduletest
PASS: objecteventtest
PASS: virmacmaptest
PASS: libvirtd-fail
PASS: libvirtd-pool
PASS: virsh-cpuset
PASS: virsh-define-dev-segfault
PASS: virsh-int-overflow
SKIP: virsh-optparse
PASS: virsh-read-bufsiz
PASS: cputest
PASS: virsh-read-non-seekable
PASS: virsh-schedinfo
PASS: virsh-self-test
PASS: virt-admin-self-test
PASS: virsh-start
PASS: virsh-undefine
PASS: virsh-uriprecedence
PASS: virsh-vcpupin
PASS: virshtest
============================================================================
Testsuite summary for libvirt 4.7.0
============================================================================
# TOTAL: 110
# PASS:  95
# SKIP:  14
# XFAIL: 0
# FAIL:  1
# XPASS: 0
# ERROR: 0
============================================================================
See tests/test-suite.log
Please report to libvir-list redhat com
============================================================================
gmake[3]: *** [Makefile:5841: test-suite.log] Error 1
gmake[3]: Leaving directory '/usr<https://ci.centos.org/job/libvirt-master-check/systems=libvirt-freebsd-10/ws/build/tests'>
gmake[2]: *** [Makefile:5949: check-TESTS] Error 2
gmake[2]: Leaving directory '/usr<https://ci.centos.org/job/libvirt-master-check/systems=libvirt-freebsd-10/ws/build/tests'>
gmake[1]: *** [Makefile:6954: check-am] Error 2
gmake[1]: Leaving directory '/usr<https://ci.centos.org/job/libvirt-master-check/systems=libvirt-freebsd-10/ws/build/tests'>
gmake: *** [Makefile:2111: check-recursive] Error 1
+ cat tests/test-suite.log
=========================================
   libvirt 4.7.0: tests/test-suite.log
=========================================

# TOTAL: 110
# PASS:  95
# SKIP:  14
# XFAIL: 0
# FAIL:  1
# XPASS: 0
# ERROR: 0

.. contents:: :depth: 2

SKIP: virhostcputest
====================

SKIP virhostcputest (exit status: 77)

SKIP: shunloadtest
==================

SKIP shunloadtest (exit status: 77)

SKIP: vircgrouptest
===================

SKIP vircgrouptest (exit status: 77)

SKIP: virpcitest
================

SKIP virpcitest (exit status: 77)

SKIP: virfirewalltest
=====================

SKIP virfirewalltest (exit status: 77)

SKIP: virportallocatortest
==========================

SKIP virportallocatortest (exit status: 77)

SKIP: virkmodtest
=================

SKIP virkmodtest (exit status: 77)

SKIP: virhostdevtest
====================

SKIP virhostdevtest (exit status: 77)

SKIP: virnetdevtest
===================

SKIP virnetdevtest (exit status: 77)

FAIL: vshtabletest
==================

TEST: vshtabletest
 1) testVshTableNew                                                   ... libvirt:  error : internal error: Table row cannot be empty
OK
 2) testVshTableHeader                                                ... OK
 3) testVshTableRowAppend                                             ... libvirt:  error : internal error: Incorrect number of cells in a table row
OK
 4) testUnicode                                                       ... 
Offset 0
Expect [ Id   ������                  ����������������������  
-----------------------------------------
 1    fedora28              running      
 2    ������������rhel7.5������������   running      
]
Actual [ Id   ������                                                                                                      ����������������������  
-----------------------------------------------------------------------------------------------------------------------------
 1    fedora28                                                                                                  running      
 2    \xff\xff\xff\xff\xff\xff\xff\xff\xff\xff\xff\xffrhel7.5\xff\xff\xff\xff\xff\xff\xff\xff\xff\xff\xff\xff   running      
]
                                                                      ... FAILED
 5) testUnicodeArabic                                                 ... OK
 6) testUnicodeZeroWidthChar                                          ... OK
 7) testUnicodeCombiningChar                                          ... OK
 8) testUnicodeNonPrintableChar                                       ... OK
 9) testNTables                                                       ... OK
FAIL vshtabletest (exit status: 1)

SKIP: virnettlscontexttest
==========================

SKIP virnettlscontexttest (exit status: 77)

SKIP: virnettlssessiontest
==========================

SKIP virnettlssessiontest (exit status: 77)

SKIP: virsystemdtest
====================

SKIP virsystemdtest (exit status: 77)

SKIP: networkxml2firewalltest
=============================

SKIP networkxml2firewalltest (exit status: 77)

SKIP: virsh-optparse
====================

../../tests/virsh-optparse: skipping test: 
This test is very expensive, so it is disabled by default.
To run it anyway, rerun: make check VIR_TEST_EXPENSIVE=1

SKIP virsh-optparse (exit status: 77)

+ exit 1
Build step 'Execute shell' marked build as failure


[Date Prev][Date Next]   [Thread Prev][Thread Next]   [Thread Index] [Date Index] [Author Index]