[Date Prev][Date Next]   [Thread Prev][Thread Next]   [Thread Index] [Date Index] [Author Index]

[Libvirt-ci] Build failed in Jenkins: libvirt-master- check » libvirt-freebsd-10 #1348



See <https://ci.centos.org/job/libvirt-master-check/systems=libvirt-freebsd-10/1348/display/redirect>

------------------------------------------
[...truncated 48.01 KB...]
SKIP: virhostcputest
PASS: virbuftest
PASS: seclabeltest
PASS: virhashtest
PASS: virconftest
PASS: commandtest
PASS: utiltest
SKIP: shunloadtest
PASS: virtimetest
PASS: viruritest
PASS: virkeyfiletest
PASS: viralloctest
PASS: virauthconfigtest
PASS: virbitmaptest
SKIP: vircgrouptest
PASS: vircryptotest
SKIP: virpcitest
PASS: virendiantest
PASS: virfiletest
PASS: virfilecachetest
SKIP: virfirewalltest
PASS: viriscsitest
PASS: virkeycodetest
PASS: virlockspacetest
PASS: viratomictest
PASS: virlogtest
PASS: virrotatingfiletest
PASS: virstringtest
SKIP: virportallocatortest
PASS: sysinfotest
SKIP: virkmodtest
PASS: vircapstest
PASS: domaincapstest
PASS: domainconftest
SKIP: virhostdevtest
SKIP: virnetdevtest
PASS: virtypedparamtest
PASS: vshtabletest
PASS: virnetmessagetest
FAIL: virnetsockettest
PASS: virnetdaemontest
PASS: virnetserverclienttest
SKIP: virnettlscontexttest
SKIP: virnettlssessiontest
PASS: fdstreamtest
PASS: virdbustest
SKIP: virsystemdtest
PASS: virpolkittest
PASS: qemuxml2argvtest
PASS: virschematest
PASS: qemuargv2xmltest
PASS: domainsnapshotxml2xmltest
PASS: qemuxml2xmltest
PASS: qemumonitorjsontest
PASS: qemuagenttest
PASS: qemuhotplugtest
PASS: qemucaps2xmltest
PASS: qemumemlocktest
PASS: qemucommandutiltest
PASS: qemublocktest
PASS: qemumigparamstest
PASS: esxutilstest
PASS: vboxsnapshotxmltest
PASS: qemucapabilitiestest
PASS: vmx2xmltest
PASS: vmwarevertest
PASS: bhyvexml2argvtest
PASS: xml2vmxtest
PASS: bhyvexml2xmltest
PASS: bhyveargv2xmltest
PASS: virjsontest
PASS: networkxml2xmltest
PASS: networkxml2conftest
SKIP: networkxml2firewalltest
PASS: networkxml2xmlupdatetest
PASS: virnwfilterbindingxml2xmltest
PASS: storagevolxml2argvtest
PASS: nwfilterxml2xmltest
PASS: virstorageutiltest
PASS: nssguesttest
PASS: nsstest
PASS: storagevolxml2xmltest
PASS: storagepoolxml2xmltest
PASS: nodedevxml2xmltest
PASS: interfacexml2xmltest
PASS: metadatatest
PASS: secretxml2xmltest
PASS: genericxml2xmltest
PASS: eventtest
PASS: virdrivermoduletest
PASS: objecteventtest
PASS: virmacmaptest
PASS: libvirtd-fail
PASS: libvirtd-pool
PASS: virsh-cpuset
PASS: virsh-define-dev-segfault
PASS: virsh-int-overflow
SKIP: virsh-optparse
PASS: virsh-read-bufsiz
PASS: virsh-read-non-seekable
PASS: virsh-schedinfo
PASS: cputest
PASS: virsh-self-test
PASS: virsh-start
PASS: virt-admin-self-test
PASS: virsh-undefine
PASS: virsh-uriprecedence
PASS: virsh-vcpupin
PASS: virshtest
============================================================================
Testsuite summary for libvirt 4.7.0
============================================================================
# TOTAL: 110
# PASS:  95
# SKIP:  14
# XFAIL: 0
# FAIL:  1
# XPASS: 0
# ERROR: 0
============================================================================
See tests/test-suite.log
Please report to libvir-list redhat com
============================================================================
gmake[3]: *** [Makefile:5841: test-suite.log] Error 1
gmake[3]: Leaving directory '/usr<https://ci.centos.org/job/libvirt-master-check/systems=libvirt-freebsd-10/ws/build/tests'>
gmake[2]: *** [Makefile:5949: check-TESTS] Error 2
gmake[2]: Leaving directory '/usr<https://ci.centos.org/job/libvirt-master-check/systems=libvirt-freebsd-10/ws/build/tests'>
gmake[1]: *** [Makefile:6954: check-am] Error 2
gmake[1]: Leaving directory '/usr<https://ci.centos.org/job/libvirt-master-check/systems=libvirt-freebsd-10/ws/build/tests'>
gmake: *** [Makefile:2111: check-recursive] Error 1
+ cat tests/test-suite.log
=========================================
   libvirt 4.7.0: tests/test-suite.log
=========================================

# TOTAL: 110
# PASS:  95
# SKIP:  14
# XFAIL: 0
# FAIL:  1
# XPASS: 0
# ERROR: 0

.. contents:: :depth: 2

SKIP: virhostcputest
====================

SKIP virhostcputest (exit status: 77)

SKIP: shunloadtest
==================

SKIP shunloadtest (exit status: 77)

SKIP: vircgrouptest
===================

SKIP vircgrouptest (exit status: 77)

SKIP: virpcitest
================

SKIP virpcitest (exit status: 77)

SKIP: virfirewalltest
=====================

SKIP virfirewalltest (exit status: 77)

SKIP: virportallocatortest
==========================

SKIP virportallocatortest (exit status: 77)

SKIP: virkmodtest
=================

SKIP virkmodtest (exit status: 77)

SKIP: virhostdevtest
====================

SKIP virhostdevtest (exit status: 77)

SKIP: virnetdevtest
===================

SKIP virnetdevtest (exit status: 77)

FAIL: virnetsockettest
======================

TEST: virnetsockettest
 1) Socket TCP/IPv4 Accept                                            ... FAILED
 2) Socket TCP/IPv6 Accept                                            ... libvirt: XML-RPC error : End of file while reading data: Input/output error
OK
 3) Socket TCP/IPv4+IPv6 Accept                                       ... libvirt: XML-RPC error : End of file while reading data: Input/output error
OK
 4) Socket TCP/IPv4+IPv6 Accept                                       ... libvirt: XML-RPC error : Cannot recv data: Connection reset by peer
OK
 5) Socket UNIX Accept                                                ... libvirt: XML-RPC error : Cannot write data: Broken pipe
OK
 6) Socket UNIX Addrs                                                 ... OK
 7) Socket External Command /dev/zero                                 ... OK
 8) Socket External Command /dev/does-not-exist                       ... libvirt: XML-RPC error : End of file while reading data: cat: /dev/does-not-exist: No such file or directory: Input/output error
OK
 9) SSH test 1                                                        ... OK
10) SSH test 2                                                        ... OK
11) SSH test 3                                                        ... OK
12) SSH test 4                                                        ... libvirt: XML-RPC error : End of file while reading data: Cannot connect to host nosuchhost: Input/output error
OK
13) SSH test 5                                                        ... libvirt: XML-RPC error : End of file while reading data: : Input/output error
OK
14) SSH test 6                                                        ... OK
15) SSH test 7                                                        ... OK
FAIL virnetsockettest (exit status: 1)

SKIP: virnettlscontexttest
==========================

SKIP virnettlscontexttest (exit status: 77)

SKIP: virnettlssessiontest
==========================

SKIP virnettlssessiontest (exit status: 77)

SKIP: virsystemdtest
====================

SKIP virsystemdtest (exit status: 77)

SKIP: networkxml2firewalltest
=============================

SKIP networkxml2firewalltest (exit status: 77)

SKIP: virsh-optparse
====================

../../tests/virsh-optparse: skipping test: 
This test is very expensive, so it is disabled by default.
To run it anyway, rerun: make check VIR_TEST_EXPENSIVE=1

SKIP virsh-optparse (exit status: 77)

+ exit 1
Build step 'Execute shell' marked build as failure


[Date Prev][Date Next]   [Thread Prev][Thread Next]   [Thread Index] [Date Index] [Author Index]