[Date Prev][Date Next]   [Thread Prev][Thread Next]   [Thread Index] [Date Index] [Author Index]

[Libvirt-ci] Build failed in Jenkins: libvirt-master- build » libvirt-freebsd-10 #1194



See <https://ci.centos.org/job/libvirt-master-build/systems=libvirt-freebsd-10/1194/display/redirect?page=changes>

Changes:

[laine] conf: move 'generated' member from virMacAddr to virDomainNetDef

------------------------------------------
[...truncated 155.55 KB...]
  GEN      bindings.html.tmp
  GEN      testapi.html.tmp
  GEN      drvvmware.html.tmp
  GEN      architecture.html.tmp
  GEN      windows.html.tmp
  GEN      formatstorageencryption.html.tmp
  GEN      formatdomain.html.tmp
  GEN      internals.html.tmp
  GEN      news-2011.html.tmp
  GEN      404.html.tmp
  GEN      drvlxc.html.tmp
  GEN      formatnwfilter.html.tmp
  GEN      goals.html.tmp
  GEN      news-2007.html.tmp
  GEN      drvtest.html.tmp
  GEN      contact.html.tmp
  GEN      support.html.tmp
  GEN      news-2014.html.tmp
  GEN      formatsecret.html.tmp
  GEN      apps.html.tmp
  GEN      firewall.html.tmp
  GEN      hooks.html.tmp
  GEN      virshcmdref.html.tmp
  GEN      news-2015.html.tmp
  GEN      drvxen.html.tmp
  GEN      index.html.tmp
  GEN      drvuml.html.tmp
  GEN      contribute.html.tmp
  GEN      drvvbox.html.tmp
  GEN      compiling.html.tmp
  GEN      news-2010.html.tmp
  GEN      auth.html.tmp
  GEN      formatnetwork.html.tmp
  GEN      formatstorage.html.tmp
  GEN      locking.html.tmp
  GEN      news-2005.html.tmp
  GEN      news-2016.html.tmp
  GEN      auditlog.html.tmp
  GEN      news-2009.html.tmp
  GEN      logging.html.tmp
  GEN      secureusage.html.tmp
  GEN      locking-sanlock.html.tmp
  GEN      downloads.html.tmp
  GEN      drvnodedev.html.tmp
  GEN      drvremote.html.tmp
  GEN      drvhyperv.html.tmp
  GEN      drvopenvz.html.tmp
  GEN      locking-lockd.html.tmp
  GEN      format.html.tmp
  GEN      errors.html.tmp
  GEN      storage.html.tmp
  GEN      cgroups.html.tmp
  GEN      devguide.html.tmp
  GEN      api_extension.html.tmp
  GEN      drivers.html.tmp
  GEN      testtck.html.tmp
  GEN      bugs.html.tmp
  GEN      drvqemu.html.tmp
  GEN      python.html.tmp
  GEN      governance.html.tmp
  GEN      news-2013.html.tmp
  GEN      securityprocess.html.tmp
  GEN      testsuites.html.tmp
  GEN      drvvirtuozzo.html.tmp
  GEN      formatdomaincaps.html.tmp
  GEN      hacking.html.tmp
  GEN      nss.html.tmp
  GEN      uri.html.tmp
  GEN      csharp.html.tmp
  GEN      remote.html.tmp
  GEN      pci-hotplug.html.tmp
  GEN      drvbhyve.html.tmp
I/O error : Attempt to load network entity http://www.w3.org/TR/xhtml1/DTD/xhtml1-strict.dtd
../../docs/pci-hotplug.html.in:2: warning: failed to load external entity "http://www.w3.org/TR/xhtml1/DTD/xhtml1-strict.dtd";
C//DTD XHTML 1.0 Strict//EN" "http://www.w3.org/TR/xhtml1/DTD/xhtml1-strict.dtd";
                                                                               ^
  GEN      docs.html.tmp
  GEN      api.html.tmp
  GEN      formatcaps.html.tmp
  GEN      formatsnapshot.html.tmp
  GEN      drvesx.html.tmp
  GEN      news-2006.html.tmp
  GEN      drvphyp.html.tmp
  GEN      java.html.tmp
  GEN      news-2012.html.tmp
  GEN      aclpolkit.html.tmp
  GEN      acl.html.tmp
  GEN      php.html.tmp
  GEN      news-2008.html.tmp
  GEN      migration.html.tmp
  GEN      internals/oomtesting.html.tmp
  GEN      internals/command.html.tmp
  GEN      internals/eventloop.html.tmp
  GEN      internals/rpc.html.tmp
  GEN      internals/locking.html.tmp
  GEN      search.php.tmp
  GEN      news.html.tmp
  GEN      formatnode.html
  GEN      bindings.html
  GEN      testapi.html
  GEN      drvvmware.html
  GEN      architecture.html
  GEN      windows.html
  GEN      formatstorageencryption.html
  GEN      formatdomain.html
  GEN      internals.html
  GEN      news-2011.html
  GEN      404.html
  GEN      drvlxc.html
  GEN      formatnwfilter.html
  GEN      goals.html
  GEN      news-2007.html
  GEN      drvtest.html
  GEN      contact.html
  GEN      support.html
  GEN      news-2014.html
  GEN      formatsecret.html
  GEN      apps.html
  GEN      hooks.html
  GEN      virshcmdref.html
  GEN      news-2015.html
  GEN      drvxen.html
  GEN      index.html
  GEN      drvuml.html
  GEN      firewall.html
  GEN      contribute.html
  GEN      drvvbox.html
  GEN      compiling.html
  GEN      news-2010.html
  GEN      auth.html
  GEN      formatnetwork.html
  GEN      formatstorage.html
  GEN      locking.html
  GEN      news-2005.html
  GEN      news-2016.html
  GEN      auditlog.html
  GEN      news-2009.html
  GEN      logging.html
  GEN      secureusage.html
  GEN      locking-sanlock.html
  GEN      downloads.html
  GEN      drvnodedev.html
  GEN      drvremote.html
  GEN      drvhyperv.html
  GEN      drvopenvz.html
  GEN      locking-lockd.html
  GEN      format.html
  GEN      storage.html
  GEN      errors.html
  GEN      cgroups.html
  GEN      api_extension.html
  GEN      devguide.html
  GEN      drivers.html
  GEN      testtck.html
  GEN      drvqemu.html
  GEN      python.html
  GEN      governance.html
  GEN      news-2013.html
  GEN      bugs.html
  GEN      securityprocess.html
  GEN      testsuites.html
  GEN      drvvirtuozzo.html
  GEN      formatdomaincaps.html
  GEN      hacking.html
  GEN      nss.html
  GEN      uri.html
  GEN      csharp.html
  GEN      remote.html
  GEN      pci-hotplug.html
  GEN      drvbhyve.html
  GEN      docs.html
  GEN      api.html
  GEN      formatcaps.html
  GEN      formatsnapshot.html
  GEN      drvesx.html
  GEN      news-2006.html
  GEN      drvphyp.html
touch ../../docs/apibuild.py.stamp
  GEN      news-2012.html
  GEN      java.html
  GEN      aclpolkit.html
  GEN      acl.html
  GEN      php.html
  GEN      news-2008.html
  GEN      migration.html
  GEN      internals/oomtesting.html
  GEN      internals/command.html
  GEN      internals/eventloop.html
  GEN      internals/rpc.html
  GEN      internals/locking.html
  GEN      search.php
  GEN      ../../docs/hvsupport.html.in
  GEN      news.html
  GEN      html/index.html
  GEN      ../../docs/devhelp/index.html
  GEN      hvsupport.html.tmp
  GEN      hvsupport.html
rm internals/rpc.html.tmp drvopenvz.html.tmp logging.html.tmp aclpolkit.html.tmp windows.html.tmp formatnwfilter.html.tmp php.html.tmp formatnetwork.html.tmp locking.html.tmp formatstorageencryption.html.tmp drvhyperv.html.tmp format.html.tmp errors.html.tmp hacking.html.tmp testsuites.html.tmp news-2008.html.tmp news-2006.html.tmp formatcaps.html.tmp news-2016.html.tmp auditlog.html.tmp downloads.html.tmp internals/oomtesting.html.tmp bugs.html.tmp drvphyp.html.tmp java.html.tmp news-2014.html.tmp testapi.html.tmp contribute.html.tmp drvesx.html.tmp locking-lockd.html.tmp devguide.html.tmp drvqemu.html.tmp drvvmware.html.tmp architecture.html.tmp drvvirtuozzo.html.tmp formatdomaincaps.html.tmp search.php.tmp formatsnapshot.html.tmp acl.html.tmp news-2005.html.tmp drvxen.html.tmp securityprocess.html.tmp internals.html.tmp 404.html.tmp api_extension.html.tmp drvuml.html.tmp news-2015.html.tmp drvremote.html.tmp hooks.html.tmp internals/locking.html.tmp python.html.tmp remote.html.tmp drivers.html.tmp compiling.html.tmp formatsecret.html.tmp news.html.tmp formatnode.html.tmp internals/eventloop.html.tmp goals.html.tmp apps.html.tmp formatdomain.html.tmp internals/command.html.tmp drvvbox.html.tmp csharp.html.tmp secureusage.html.tmp formatstorage.html.tmp governance.html.tmp cgroups.html.tmp news-2009.html.tmp bindings.html.tmp api.html.tmp news-2010.html.tmp contact.html.tmp drvnodedev.html.tmp news-2011.html.tmp index.html.tmp auth.html.tmp drvlxc.html.tmp uri.html.tmp pci-hotplug.html.tmp news-2012.html.tmp hvsupport.html.tmp locking-sanlock.html.tmp drvtest.html.tmp support.html.tmp testtck.html.tmp docs.html.tmp news-2013.html.tmp drvbhyve.html.tmp nss.html.tmp migration.html.tmp storage.html.tmp firewall.html.tmp virshcmdref.html.tmp news-2007.html.tmp
gmake[2]: Leaving directory '/usr<https://ci.centos.org/job/libvirt-master-build/systems=libvirt-freebsd-10/ws/build/docs'>
Making all in gnulib/tests
gmake[2]: Entering directory '/usr<https://ci.centos.org/job/libvirt-master-build/systems=libvirt-freebsd-10/ws/build/gnulib/tests'>
  GEN      ctype.h
  GEN      inttypes.h
  GEN      math.h
  GEN      test-posix_spawn1.sh
  GEN      test-posix_spawn2.sh
  GEN      spawn.h
gmake  all-recursive
gmake[3]: Entering directory '/usr<https://ci.centos.org/job/libvirt-master-build/systems=libvirt-freebsd-10/ws/build/gnulib/tests'>
Making all in .
gmake[4]: Entering directory '/usr<https://ci.centos.org/job/libvirt-master-build/systems=libvirt-freebsd-10/ws/build/gnulib/tests'>
gmake[4]: Nothing to be done for 'all-am'.
gmake[4]: Leaving directory '/usr<https://ci.centos.org/job/libvirt-master-build/systems=libvirt-freebsd-10/ws/build/gnulib/tests'>
gmake[3]: Leaving directory '/usr<https://ci.centos.org/job/libvirt-master-build/systems=libvirt-freebsd-10/ws/build/gnulib/tests'>
gmake[2]: Leaving directory '/usr<https://ci.centos.org/job/libvirt-master-build/systems=libvirt-freebsd-10/ws/build/gnulib/tests'>
Making all in tests
gmake[2]: Entering directory '/usr<https://ci.centos.org/job/libvirt-master-build/systems=libvirt-freebsd-10/ws/build/tests'>
  CC       shunloadhelper.lo
  CC       virportallocatormock.lo
  CC       virnetdaemonmock.lo
  CC       virnetserverclientmock.lo
  CC       vircgroupmock.lo
  CC       virpcimock.lo
  CC       virnetdevmock_la-virnetdevmock.lo
  CC       virrandommock.lo
  CC       virhostcpumock.lo
  CC       domaincapsmock.lo
  CC       virfilecachemock.lo
  CC       virdbusmock_la-virdbusmock.lo
  CC       qemumonitortestutils.lo
  CCLD     libqemutestdriver.la
  CC       qemuxml2argvmock.lo
  CC       qemucaps2xmlmock.lo
  CC       qemucapsprobemock.lo
  CC       qemucpumock.lo
  CC       bhyvexml2argvmock.lo
  CC       bhyveargv2xmlmock.lo
  CC       nssmock.lo
../../tests/bhyvexml2argvmock.c:20:11: error: no member named 'generated' in 'struct _virMacAddr'
    addr->generated = true;
    ~~~~  ^
1 error generated.
gmake[2]: *** [Makefile:5411: bhyvexml2argvmock.lo] Error 1
gmake[2]: *** Waiting for unfinished jobs....
gmake[2]: Leaving directory '/usr<https://ci.centos.org/job/libvirt-master-build/systems=libvirt-freebsd-10/ws/build/tests'>
gmake[1]: *** [Makefile:2125: all-recursive] Error 1
gmake[1]: Leaving directory '/usr<https://ci.centos.org/job/libvirt-master-build/systems=libvirt-freebsd-10/ws/build'>
gmake: *** [Makefile:2018: all] Error 2
Build step 'Execute shell' marked build as failure


[Date Prev][Date Next]   [Thread Prev][Thread Next]   [Thread Index] [Date Index] [Author Index]