[Date Prev][Date Next]   [Thread Prev][Thread Next]   [Thread Index] [Date Index] [Author Index]

[Libvirt-ci] Build failed in Jenkins: libvirt-master- build » libvirt-fedora-rawhide #1210



See <https://ci.centos.org/job/libvirt-master-build/systems=libvirt-fedora-rawhide/1210/display/redirect?page=changes>

Changes:

[berrange] make: fix VPATH build for libvirtd augeas check

[mprivozn] src: Clean *.logrotate, .aug and libvirtd.policy files on 'make clean'

------------------------------------------
[...truncated 253.41 KB...]
1178 translated messages, 690 fuzzy translations, 7933 untranslated messages.
cd ../../po && rm -f gl.gmo && /usr/bin/msgfmt -c --statistics -o gl.gmo gl.po
cd ../../po && rm -f gu.gmo && /usr/bin/msgfmt -c --statistics -o gu.gmo gu.po
cd ../../po && rm -f he.gmo && /usr/bin/msgfmt -c --statistics -o he.gmo he.po
218 translated messages, 705 fuzzy translations, 8878 untranslated messages.
cd ../../po && rm -f hi.gmo && /usr/bin/msgfmt -c --statistics -o hi.gmo hi.po
218 translated messages, 674 fuzzy translations, 8909 untranslated messages.
cd ../../po && rm -f hr.gmo && /usr/bin/msgfmt -c --statistics -o hr.gmo hr.po
6116 translated messages, 424 fuzzy translations, 3261 untranslated messages.
cd ../../po && rm -f hu.gmo && /usr/bin/msgfmt -c --statistics -o hu.gmo hu.po
3812 translated messages, 769 fuzzy translations, 5220 untranslated messages.
0 translated messages, 9801 untranslated messages.
cd ../../po && rm -f ia.gmo && /usr/bin/msgfmt -c --statistics -o ia.gmo ia.po
cd ../../po && rm -f id.gmo && /usr/bin/msgfmt -c --statistics -o id.gmo id.po
283 translated messages, 704 fuzzy translations, 8814 untranslated messages.
cd ../../po && rm -f ilo.gmo && /usr/bin/msgfmt -c --statistics -o ilo.gmo ilo.po
0 translated messages, 9801 untranslated messages.
cd ../../po && rm -f is.gmo && /usr/bin/msgfmt -c --statistics -o is.gmo is.po
215 translated messages, 696 fuzzy translations, 8890 untranslated messages.
cd ../../po && rm -f it.gmo && /usr/bin/msgfmt -c --statistics -o it.gmo it.po
0 translated messages, 9801 untranslated messages.
218 translated messages, 674 fuzzy translations, 8909 untranslated messages.
cd ../../po && rm -f ja.gmo && /usr/bin/msgfmt -c --statistics -o ja.gmo ja.po
cd ../../po && rm -f ka.gmo && /usr/bin/msgfmt -c --statistics -o ka.gmo ka.po
1824 translated messages, 106 fuzzy translations, 7871 untranslated messages.
cd ../../po && rm -f kk.gmo && /usr/bin/msgfmt -c --statistics -o kk.gmo kk.po
218 translated messages, 674 fuzzy translations, 8909 untranslated messages.
cd ../../po && rm -f km.gmo && /usr/bin/msgfmt -c --statistics -o km.gmo km.po
6036 translated messages, 395 fuzzy translations, 3370 untranslated messages.
0 translated messages, 9801 untranslated messages.
cd ../../po && rm -f kn.gmo && /usr/bin/msgfmt -c --statistics -o kn.gmo kn.po
cd ../../po && rm -f ko.gmo && /usr/bin/msgfmt -c --statistics -o ko.gmo ko.po
0 translated messages, 9801 untranslated messages.
cd ../../po && rm -f kw.gmo && /usr/bin/msgfmt -c --statistics -o kw.gmo kw.po
3512 translated messages, 208 fuzzy translations, 6081 untranslated messages.
cd ../../po && rm -f kw kkcor gmo && /usr/bin/msgfmt -c --statistics -o kw kkcor gmo kw kkcor po
5956 translated messages, 288 fuzzy translations, 3557 untranslated messages.
cd ../../po && rm -f kw uccor gmo && /usr/bin/msgfmt -c --statistics -o kw uccor gmo kw uccor po
0 translated messages, 9801 untranslated messages.
0 translated messages, 9801 untranslated messages.
cd ../../po && rm -f kw_GB.gmo && /usr/bin/msgfmt -c --statistics -o kw_GB.gmo kw_GB.po
cd ../../po && rm -f ky.gmo && /usr/bin/msgfmt -c --statistics -o ky.gmo ky.po
0 translated messages, 9801 untranslated messages.
0 translated messages, 9801 untranslated messages.
0 translated messages, 9801 untranslated messages.
make[3]: Leaving directory '<https://ci.centos.org/job/libvirt-master-build/systems=libvirt-fedora-rawhide/ws/build/po'>
touch stamp-po
make[2]: Leaving directory '<https://ci.centos.org/job/libvirt-master-build/systems=libvirt-fedora-rawhide/ws/build/po'>
Making all in examples
make[2]: Entering directory '<https://ci.centos.org/job/libvirt-master-build/systems=libvirt-fedora-rawhide/ws/build/examples'>
  CC       dominfo/info1.o
  CC       dommigrate/dommigrate.o
  CC       domsuspend/suspend.o
  CC       domtop/domtop.o
  CC       hellolibvirt/hellolibvirt.o
  CC       object-events/object_events_event_test-event-test.o
  CC       openauth/openauth.o
  CC       rename/rename.o
  CC       admin/list_servers.o
  CC       admin/list_clients.o
  CC       admin/threadpool_params.o
  CC       admin/client_limits.o
  CC       admin/client_info.o
  CC       admin/client_close.o
  CC       admin/logging.o
  CCLD     dominfo/info1
  CCLD     dommigrate/dommigrate
  CCLD     domsuspend/suspend
  CCLD     domtop/domtop
  CCLD     hellolibvirt/hellolibvirt
  CCLD     object-events/event-test
  CCLD     openauth/openauth
  CCLD     rename/rename
  CCLD     admin/list_servers
  CCLD     admin/list_clients
  CCLD     admin/threadpool_params
  CCLD     admin/client_limits
  CCLD     admin/client_info
  CCLD     admin/client_close
  CCLD     admin/logging
make[2]: Leaving directory '<https://ci.centos.org/job/libvirt-master-build/systems=libvirt-fedora-rawhide/ws/build/examples'>
make[1]: Leaving directory '<https://ci.centos.org/job/libvirt-master-build/systems=libvirt-fedora-rawhide/ws/build'>
+ make -j3 install
Making install in .
make[1]: Entering directory '<https://ci.centos.org/job/libvirt-master-build/systems=libvirt-fedora-rawhide/ws/build'>
make[2]: Entering directory '<https://ci.centos.org/job/libvirt-master-build/systems=libvirt-fedora-rawhide/ws/build'>
make[2]: Nothing to be done for 'install-exec-am'.
 /usr/bin/mkdir -p '/home/jenkins/build/libvirt/lib/pkgconfig'
 /usr/bin/install -c -m 644 libvirt.pc libvirt-qemu.pc libvirt-lxc.pc libvirt-admin.pc '/home/jenkins/build/libvirt/lib/pkgconfig'
make[2]: Leaving directory '<https://ci.centos.org/job/libvirt-master-build/systems=libvirt-fedora-rawhide/ws/build'>
make[1]: Leaving directory '<https://ci.centos.org/job/libvirt-master-build/systems=libvirt-fedora-rawhide/ws/build'>
Making install in gnulib/lib
make[1]: Entering directory '<https://ci.centos.org/job/libvirt-master-build/systems=libvirt-fedora-rawhide/ws/build/gnulib/lib'>
make  install-am
make[2]: Entering directory '<https://ci.centos.org/job/libvirt-master-build/systems=libvirt-fedora-rawhide/ws/build/gnulib/lib'>
make[3]: Entering directory '<https://ci.centos.org/job/libvirt-master-build/systems=libvirt-fedora-rawhide/ws/build/gnulib/lib'>
if test yes = no; then \
  case 'linux-gnu' in \
    darwin[56]*) \
      need_charset_alias=true ;; \
    darwin* | cygwin* | mingw* | pw32* | cegcc*) \
      need_charset_alias=false ;; \
    *) \
      need_charset_alias=true ;; \
  esac ; \
else \
  need_charset_alias=false ; \
fi ; \
if $need_charset_alias; then \
  /bin/sh <https://ci.centos.org/job/libvirt-master-build/systems=libvirt-fedora-rawhide/ws/build-aux/install-sh> -d /home/jenkins/build/libvirt/lib ; \
fi ; \
if test -f /home/jenkins/build/libvirt/lib/charset.alias; then \
  sed -f ref-add.sed /home/jenkins/build/libvirt/lib/charset.alias > /home/jenkins/build/libvirt/lib/charset.tmp ; \
  /usr/bin/install -c -m 644 /home/jenkins/build/libvirt/lib/charset.tmp /home/jenkins/build/libvirt/lib/charset.alias ; \
  rm -f /home/jenkins/build/libvirt/lib/charset.tmp ; \
else \
  if $need_charset_alias; then \
    sed -f ref-add.sed charset.alias > /home/jenkins/build/libvirt/lib/charset.tmp ; \
    /usr/bin/install -c -m 644 /home/jenkins/build/libvirt/lib/charset.tmp /home/jenkins/build/libvirt/lib/charset.alias ; \
    rm -f /home/jenkins/build/libvirt/lib/charset.tmp ; \
  fi ; \
fi
make[3]: Nothing to be done for 'install-data-am'.
make[3]: Leaving directory '<https://ci.centos.org/job/libvirt-master-build/systems=libvirt-fedora-rawhide/ws/build/gnulib/lib'>
make[2]: Leaving directory '<https://ci.centos.org/job/libvirt-master-build/systems=libvirt-fedora-rawhide/ws/build/gnulib/lib'>
make[1]: Leaving directory '<https://ci.centos.org/job/libvirt-master-build/systems=libvirt-fedora-rawhide/ws/build/gnulib/lib'>
Making install in include/libvirt
make[1]: Entering directory '<https://ci.centos.org/job/libvirt-master-build/systems=libvirt-fedora-rawhide/ws/build/include/libvirt'>
make[2]: Entering directory '<https://ci.centos.org/job/libvirt-master-build/systems=libvirt-fedora-rawhide/ws/build/include/libvirt'>
make  install-exec-hook
 /usr/bin/mkdir -p '/home/jenkins/build/libvirt/include/libvirt'
make[3]: Entering directory '<https://ci.centos.org/job/libvirt-master-build/systems=libvirt-fedora-rawhide/ws/build/include/libvirt'>
/bin/sh <https://ci.centos.org/job/libvirt-master-build/systems=libvirt-fedora-rawhide/ws/build-aux/install-sh> -d /home/jenkins/build/libvirt/include/libvirt
 /usr/bin/install -c -m 644 ../../../include/libvirt/libvirt-domain.h ../../../include/libvirt/libvirt-interface.h ../../../include/libvirt/libvirt-qemu.h ../../../include/libvirt/libvirt-storage.h ../../../include/libvirt/libvirt-nwfilter.h ../../../include/libvirt/libvirt-secret.h ../../../include/libvirt/libvirt-nodedev.h ../../../include/libvirt/libvirt-event.h ../../../include/libvirt/virterror.h ../../../include/libvirt/libvirt-stream.h ../../../include/libvirt/libvirt-admin.h ../../../include/libvirt/libvirt-host.h ../../../include/libvirt/libvirt-network.h ../../../include/libvirt/libvirt.h ../../../include/libvirt/libvirt-lxc.h ../../../include/libvirt/libvirt-domain-snapshot.h libvirt-common.h '/home/jenkins/build/libvirt/include/libvirt'
make[3]: Leaving directory '<https://ci.centos.org/job/libvirt-master-build/systems=libvirt-fedora-rawhide/ws/build/include/libvirt'>
make[2]: Leaving directory '<https://ci.centos.org/job/libvirt-master-build/systems=libvirt-fedora-rawhide/ws/build/include/libvirt'>
make[1]: Leaving directory '<https://ci.centos.org/job/libvirt-master-build/systems=libvirt-fedora-rawhide/ws/build/include/libvirt'>
Making install in src
make[1]: Entering directory '<https://ci.centos.org/job/libvirt-master-build/systems=libvirt-fedora-rawhide/ws/build/src'>
make  install-am
make[2]: Entering directory '<https://ci.centos.org/job/libvirt-master-build/systems=libvirt-fedora-rawhide/ws/build/src'>
make[3]: Entering directory '<https://ci.centos.org/job/libvirt-master-build/systems=libvirt-fedora-rawhide/ws/build/src'>
 /usr/bin/mkdir -p '/home/jenkins/build/libvirt/lib'
 /bin/sh ../libtool   --mode=install /usr/bin/install -c   libvirt.la libvirt-qemu.la libvirt-lxc.la libvirt-admin.la '/home/jenkins/build/libvirt/lib'
 /usr/bin/mkdir -p '/home/jenkins/build/libvirt/libexec'
 /usr/bin/mkdir -p '/home/jenkins/build/libvirt/sbin'
  /bin/sh ../libtool   --mode=install /usr/bin/install -c libvirt_iohelper libvirt_leaseshelper libvirt_parthelper libvirt_sanlock_helper libvirt_lxc '/home/jenkins/build/libvirt/libexec'
  /bin/sh ../libtool   --mode=install /usr/bin/install -c libvirtd virtlockd virtlogd '/home/jenkins/build/libvirt/sbin'
libtool: install: /usr/bin/install -c .libs/libvirt.so.0.4001.0 /home/jenkins/build/libvirt/lib/libvirt.so.0.4001.0
libtool: install: /usr/bin/install -c libvirt_iohelper /home/jenkins/build/libvirt/libexec/libvirt_iohelper
libtool: install: /usr/bin/install -c libvirt_leaseshelper /home/jenkins/build/libvirt/libexec/libvirt_leaseshelper
libtool: install: /usr/bin/install -c libvirt_parthelper /home/jenkins/build/libvirt/libexec/libvirt_parthelper
libtool: install: (cd /home/jenkins/build/libvirt/lib && { ln -s -f libvirt.so.0.4001.0 libvirt.so.0 || { rm -f libvirt.so.0 && ln -s libvirt.so.0.4001.0 libvirt.so.0; }; })
libtool: install: (cd /home/jenkins/build/libvirt/lib && { ln -s -f libvirt.so.0.4001.0 libvirt.so || { rm -f libvirt.so && ln -s libvirt.so.0.4001.0 libvirt.so; }; })
libtool: install: /usr/bin/install -c .libs/libvirtd /home/jenkins/build/libvirt/sbin/libvirtd
libtool: install: /usr/bin/install -c .libs/libvirt.lai /home/jenkins/build/libvirt/lib/libvirt.la
libtool: warning: relinking 'libvirt-qemu.la'
libtool: install: /usr/bin/install -c virtlockd /home/jenkins/build/libvirt/sbin/virtlockd
libtool: install: /usr/bin/install -c .libs/libvirt_sanlock_helper /home/jenkins/build/libvirt/libexec/libvirt_sanlock_helper
libtool: install: (cd <https://ci.centos.org/job/libvirt-master-build/systems=libvirt-fedora-rawhide/ws/build/src;> /bin/sh "<https://ci.centos.org/job/libvirt-master-build/systems=libvirt-fedora-rawhide/ws/build/libtool";>  --silent --tag CC --mode=relink gcc -I/usr/include/libxml2 -fno-common -W -Waddress -Waggressive-loop-optimizations -Wall -Wattributes -Wbad-function-cast -Wbool-compare -Wbool-operation -Wbuiltin-declaration-mismatch -Wbuiltin-macro-redefined -Wcast-align -Wchar-subscripts -Wchkp -Wclobbered -Wcomment -Wcomments -Wcoverage-mismatch -Wcpp -Wdangling-else -Wdate-time -Wdeprecated-declarations -Wdesignated-init -Wdiscarded-array-qualifiers -Wdiscarded-qualifiers -Wdiv-by-zero -Wdouble-promotion -Wduplicated-cond -Wduplicate-decl-specifier -Wempty-body -Wendif-labels -Wexpansion-to-defined -Wextra -Wformat-contains-nul -Wformat-extra-args -Wformat-security -Wformat-y2k -Wformat-zero-length -Wframe-address -Wfree-nonheap-object -Whsa -Wignored-attributes -Wignored-qualifiers -Wimplicit -Wimplicit-function-declaration -Wimplicit-int -Wincompatible-pointer-types -Winit-self -Winline -Wint-conversion -Wint-in-bool-context -Wint-to-pointer-cast -Winvalid-memory-model -Winvalid-pch -Wjump-misses-init -Wlogical-not-parentheses -Wlogical-op -Wmain -Wmaybe-uninitialized -Wmemset-elt-size -Wmemset-transposed-args -Wmisleading-indentation -Wmissing-braces -Wmissing-declarations -Wmissing-field-initializers -Wmissing-include-dirs -Wmissing-parameter-type -Wmissing-prototypes -Wmultichar -Wnarrowing -Wnested-externs -Wnonnull -Wnonnull-compare -Wnull-dereference -Wodr -Wold-style-declaration -Wold-style-definition -Wopenmp-simd -Woverflow -Woverride-init -Wpacked-bitfield-compat -Wparentheses -Wpointer-arith -Wpointer-compare -Wpointer-sign -Wpointer-to-int-cast -Wpragmas -Wpsabi -Wrestrict -Wreturn-local-addr -Wreturn-type -Wscalar-storage-order -Wsequence-point -Wshadow -Wshift-count-negative -Wshift-count-overflow -Wshift-negative-value -Wsizeof-array-argument -Wsizeof-pointer-memaccess -Wstrict-aliasing -Wstrict-prototypes -Wsuggest-attribute=const -Wsuggest-attribute=format -Wsuggest-attribute=noreturn -Wsuggest-attribute=pure -Wsuggest-final-methods -Wsuggest-final-types -Wswitch -Wswitch-bool -Wswitch-unreachable -Wsync-nand -Wtautological-compare -Wtrampolines -Wtrigraphs -Wtype-limits -Wuninitialized -Wunknown-pragmas -Wunused -Wunused-but-set-parameter -Wunused-but-set-variable -Wunused-function -Wunused-label -Wunused-local-typedefs -Wunused-parameter -Wunused-result -Wunused-value -Wunused-variable -Wvarargs -Wvariadic-macros -Wvector-operation-performance -Wvolatile-register-var -Wwrite-strings -Walloc-size-larger-than=9223372036854775807 -Warray-bounds=2 -Wformat-overflow=2 -Wformat-truncation=2 -Wimplicit-fallthrough=5 -Wnormalized=nfc -Wshift-overflow=2 -Wstringop-overflow=2 -Wunused-const-variable=2 -Wvla-larger-than=4031 -Wno-sign-compare -Wno-cast-function-type -Wjump-misses-init -Wswitch-enum -Wno-format-nonliteral -Wno-format-truncation -fstack-protector-strong -fexceptions -fasynchronous-unwind-tables -fipa-pure-const -Wno-suggest-attribute=pure -Wno-suggest-attribute=const -Werror -Wframe-larger-than=4096 -g -O2 -DLIBXL_API_VERSION=0x040400 -Wl,--version-script=../../src/libvirt_qemu.syms -version-info 4001:0:4001 -export-dynamic -Wl,-z -Wl,relro -Wl,-z -Wl,now -Wl,--no-copy-dt-needed-entries -o libvirt-qemu.la -rpath /home/jenkins/build/libvirt/lib libvirt_qemu_la-libvirt-qemu.lo libvirt.la -ltirpc -ldl )
libtool: install: /usr/bin/install -c virtlogd /home/jenkins/build/libvirt/sbin/virtlogd
 /usr/bin/mkdir -p '/home/jenkins/build/libvirt/share/augeas/lenses'
libtool: install: /usr/bin/install -c .libs/libvirt_lxc /home/jenkins/build/libvirt/libexec/libvirt_lxc
 /usr/bin/install -c -m 644 ../../src/remote/libvirtd.aug ../../src/libxl/libvirtd_libxl.aug ../../src/qemu/libvirtd_qemu.aug ../../src/lxc/libvirtd_lxc.aug ../../src/locking/libvirt_lockd.aug ../../src/locking/virtlockd.aug ../../src/logging/virtlogd.aug ../../src/locking/libvirt_sanlock.aug '/home/jenkins/build/libvirt/share/augeas/lenses'
 /usr/bin/mkdir -p '/home/jenkins/build/libvirt/share/augeas/lenses/tests'
 /usr/bin/mkdir -p '/home/jenkins/build/libvirt/etc/libvirt'
 /usr/bin/install -c -m 644 test_libvirtd.aug test_libvirtd_libxl.aug test_libvirtd_qemu.aug test_libvirtd_lxc.aug test_libvirt_lockd.aug test_virtlockd.aug test_virtlogd.aug test_libvirt_sanlock.aug '/home/jenkins/build/libvirt/share/augeas/lenses/tests'
 /usr/bin/install -c -m 644 ../../src/libvirt.conf ../../src/libvirt-admin.conf ../../src/remote/libvirtd.conf ../../src/libxl/libxl.conf ../../src/qemu/qemu.conf ../../src/lxc/lxc.conf ../../src/locking/virtlockd.conf ../../src/logging/virtlogd.conf '/home/jenkins/build/libvirt/etc/libvirt'
/usr/bin/mkdir -p /home/jenkins/build/libvirt/etc/sysconfig
/usr/bin/mkdir -p /home/jenkins/build/libvirt/lib/sysctl.d
for f in locking/virtlockd logging/virtlogd remote/libvirtd ; \
do \
  tgt=`basename $f`; \
  /usr/bin/install -c $f.sysconf /home/jenkins/build/libvirt/etc/sysconfig/$tgt; \
done
/usr/bin/install -c -m 644 ../../src/remote/libvirtd.sysctl \
  /home/jenkins/build/libvirt/lib/sysctl.d/60-libvirtd.conf
/usr/bin/mkdir -p /home/jenkins/build/libvirt/share/polkit-1/actions
/usr/bin/install -c -m 644 libvirtd.policy /home/jenkins/build/libvirt/share/polkit-1/actions/org.libvirt.unix.policy
/usr/bin/install: cannot stat 'locking/virtlockd.sysconf': No such file or directory
/usr/bin/mkdir -p /home/jenkins/build/libvirt/share/polkit-1/rules.d
/usr/bin/install -c -m 644 ../../src/remote/libvirtd.rules \
	/home/jenkins/build/libvirt/share/polkit-1/rules.d/50-libvirt.rules
/usr/bin/install: cannot stat 'logging/virtlogd.sysconf': No such file or directory
/usr/bin/mkdir -p /home/jenkins/build/libvirt/etc/sasl2/
/usr/bin/install -c -m 644 ../../src/remote/libvirtd.sasl \
	/home/jenkins/build/libvirt/etc/sasl2/libvirt.conf
/usr/bin/mkdir -p /home/jenkins/build/libvirt/etc/logrotate.d/
for f in libvirtd.qemu.logrotate libvirtd.lxc.logrotate libvirtd.libxl.logrotate libvirtd.uml.logrotate libvirtd.logrotate ; \
do \
  tgt=`echo $f | sed -e 's/.logrotate//'`; \
  /usr/bin/install -c -m 644 $f \
	/home/jenkins/build/libvirt/etc/logrotate.d/$tgt; \
done
/usr/bin/install: cannot stat 'remote/libvirtd.sysconf': No such file or directory
make[3]: *** [Makefile:12607: install-sysconfig] Error 1
make[3]: *** Waiting for unfinished jobs....
libtool: install: /usr/bin/install -c .libs/libvirt-qemu.so.0.4001.0T /home/jenkins/build/libvirt/lib/libvirt-qemu.so.0.4001.0
libtool: install: (cd /home/jenkins/build/libvirt/lib && { ln -s -f libvirt-qemu.so.0.4001.0 libvirt-qemu.so.0 || { rm -f libvirt-qemu.so.0 && ln -s libvirt-qemu.so.0.4001.0 libvirt-qemu.so.0; }; })
libtool: install: (cd /home/jenkins/build/libvirt/lib && { ln -s -f libvirt-qemu.so.0.4001.0 libvirt-qemu.so || { rm -f libvirt-qemu.so && ln -s libvirt-qemu.so.0.4001.0 libvirt-qemu.so; }; })
libtool: install: /usr/bin/install -c .libs/libvirt-qemu.lai /home/jenkins/build/libvirt/lib/libvirt-qemu.la
libtool: warning: relinking 'libvirt-lxc.la'
libtool: install: (cd <https://ci.centos.org/job/libvirt-master-build/systems=libvirt-fedora-rawhide/ws/build/src;> /bin/sh "<https://ci.centos.org/job/libvirt-master-build/systems=libvirt-fedora-rawhide/ws/build/libtool";>  --silent --tag CC --mode=relink gcc -I/usr/include/libxml2 -fno-common -W -Waddress -Waggressive-loop-optimizations -Wall -Wattributes -Wbad-function-cast -Wbool-compare -Wbool-operation -Wbuiltin-declaration-mismatch -Wbuiltin-macro-redefined -Wcast-align -Wchar-subscripts -Wchkp -Wclobbered -Wcomment -Wcomments -Wcoverage-mismatch -Wcpp -Wdangling-else -Wdate-time -Wdeprecated-declarations -Wdesignated-init -Wdiscarded-array-qualifiers -Wdiscarded-qualifiers -Wdiv-by-zero -Wdouble-promotion -Wduplicated-cond -Wduplicate-decl-specifier -Wempty-body -Wendif-labels -Wexpansion-to-defined -Wextra -Wformat-contains-nul -Wformat-extra-args -Wformat-security -Wformat-y2k -Wformat-zero-length -Wframe-address -Wfree-nonheap-object -Whsa -Wignored-attributes -Wignored-qualifiers -Wimplicit -Wimplicit-function-declaration -Wimplicit-int -Wincompatible-pointer-types -Winit-self -Winline -Wint-conversion -Wint-in-bool-context -Wint-to-pointer-cast -Winvalid-memory-model -Winvalid-pch -Wjump-misses-init -Wlogical-not-parentheses -Wlogical-op -Wmain -Wmaybe-uninitialized -Wmemset-elt-size -Wmemset-transposed-args -Wmisleading-indentation -Wmissing-braces -Wmissing-declarations -Wmissing-field-initializers -Wmissing-include-dirs -Wmissing-parameter-type -Wmissing-prototypes -Wmultichar -Wnarrowing -Wnested-externs -Wnonnull -Wnonnull-compare -Wnull-dereference -Wodr -Wold-style-declaration -Wold-style-definition -Wopenmp-simd -Woverflow -Woverride-init -Wpacked-bitfield-compat -Wparentheses -Wpointer-arith -Wpointer-compare -Wpointer-sign -Wpointer-to-int-cast -Wpragmas -Wpsabi -Wrestrict -Wreturn-local-addr -Wreturn-type -Wscalar-storage-order -Wsequence-point -Wshadow -Wshift-count-negative -Wshift-count-overflow -Wshift-negative-value -Wsizeof-array-argument -Wsizeof-pointer-memaccess -Wstrict-aliasing -Wstrict-prototypes -Wsuggest-attribute=const -Wsuggest-attribute=format -Wsuggest-attribute=noreturn -Wsuggest-attribute=pure -Wsuggest-final-methods -Wsuggest-final-types -Wswitch -Wswitch-bool -Wswitch-unreachable -Wsync-nand -Wtautological-compare -Wtrampolines -Wtrigraphs -Wtype-limits -Wuninitialized -Wunknown-pragmas -Wunused -Wunused-but-set-parameter -Wunused-but-set-variable -Wunused-function -Wunused-label -Wunused-local-typedefs -Wunused-parameter -Wunused-result -Wunused-value -Wunused-variable -Wvarargs -Wvariadic-macros -Wvector-operation-performance -Wvolatile-register-var -Wwrite-strings -Walloc-size-larger-than=9223372036854775807 -Warray-bounds=2 -Wformat-overflow=2 -Wformat-truncation=2 -Wimplicit-fallthrough=5 -Wnormalized=nfc -Wshift-overflow=2 -Wstringop-overflow=2 -Wunused-const-variable=2 -Wvla-larger-than=4031 -Wno-sign-compare -Wno-cast-function-type -Wjump-misses-init -Wswitch-enum -Wno-format-nonliteral -Wno-format-truncation -fstack-protector-strong -fexceptions -fasynchronous-unwind-tables -fipa-pure-const -Wno-suggest-attribute=pure -Wno-suggest-attribute=const -Werror -Wframe-larger-than=4096 -g -O2 -DLIBXL_API_VERSION=0x040400 -Wl,--version-script=../../src/libvirt_lxc.syms -version-info 4001:0:4001 -export-dynamic -Wl,-z -Wl,relro -Wl,-z -Wl,now -Wl,--no-copy-dt-needed-entries -o libvirt-lxc.la -rpath /home/jenkins/build/libvirt/lib libvirt_lxc_la-libvirt-lxc.lo libvirt.la -ltirpc -ldl )
libtool: install: /usr/bin/install -c .libs/libvirt-lxc.so.0.4001.0T /home/jenkins/build/libvirt/lib/libvirt-lxc.so.0.4001.0
libtool: install: (cd /home/jenkins/build/libvirt/lib && { ln -s -f libvirt-lxc.so.0.4001.0 libvirt-lxc.so.0 || { rm -f libvirt-lxc.so.0 && ln -s libvirt-lxc.so.0.4001.0 libvirt-lxc.so.0; }; })
libtool: install: (cd /home/jenkins/build/libvirt/lib && { ln -s -f libvirt-lxc.so.0.4001.0 libvirt-lxc.so || { rm -f libvirt-lxc.so && ln -s libvirt-lxc.so.0.4001.0 libvirt-lxc.so; }; })
libtool: install: /usr/bin/install -c .libs/libvirt-lxc.lai /home/jenkins/build/libvirt/lib/libvirt-lxc.la
libtool: warning: relinking 'libvirt-admin.la'
libtool: install: (cd <https://ci.centos.org/job/libvirt-master-build/systems=libvirt-fedora-rawhide/ws/build/src;> /bin/sh "<https://ci.centos.org/job/libvirt-master-build/systems=libvirt-fedora-rawhide/ws/build/libtool";>  --silent --tag CC --mode=relink gcc -I/usr/include/libxml2 -fno-common -W -Waddress -Waggressive-loop-optimizations -Wall -Wattributes -Wbad-function-cast -Wbool-compare -Wbool-operation -Wbuiltin-declaration-mismatch -Wbuiltin-macro-redefined -Wcast-align -Wchar-subscripts -Wchkp -Wclobbered -Wcomment -Wcomments -Wcoverage-mismatch -Wcpp -Wdangling-else -Wdate-time -Wdeprecated-declarations -Wdesignated-init -Wdiscarded-array-qualifiers -Wdiscarded-qualifiers -Wdiv-by-zero -Wdouble-promotion -Wduplicated-cond -Wduplicate-decl-specifier -Wempty-body -Wendif-labels -Wexpansion-to-defined -Wextra -Wformat-contains-nul -Wformat-extra-args -Wformat-security -Wformat-y2k -Wformat-zero-length -Wframe-address -Wfree-nonheap-object -Whsa -Wignored-attributes -Wignored-qualifiers -Wimplicit -Wimplicit-function-declaration -Wimplicit-int -Wincompatible-pointer-types -Winit-self -Winline -Wint-conversion -Wint-in-bool-context -Wint-to-pointer-cast -Winvalid-memory-model -Winvalid-pch -Wjump-misses-init -Wlogical-not-parentheses -Wlogical-op -Wmain -Wmaybe-uninitialized -Wmemset-elt-size -Wmemset-transposed-args -Wmisleading-indentation -Wmissing-braces -Wmissing-declarations -Wmissing-field-initializers -Wmissing-include-dirs -Wmissing-parameter-type -Wmissing-prototypes -Wmultichar -Wnarrowing -Wnested-externs -Wnonnull -Wnonnull-compare -Wnull-dereference -Wodr -Wold-style-declaration -Wold-style-definition -Wopenmp-simd -Woverflow -Woverride-init -Wpacked-bitfield-compat -Wparentheses -Wpointer-arith -Wpointer-compare -Wpointer-sign -Wpointer-to-int-cast -Wpragmas -Wpsabi -Wrestrict -Wreturn-local-addr -Wreturn-type -Wscalar-storage-order -Wsequence-point -Wshadow -Wshift-count-negative -Wshift-count-overflow -Wshift-negative-value -Wsizeof-array-argument -Wsizeof-pointer-memaccess -Wstrict-aliasing -Wstrict-prototypes -Wsuggest-attribute=const -Wsuggest-attribute=format -Wsuggest-attribute=noreturn -Wsuggest-attribute=pure -Wsuggest-final-methods -Wsuggest-final-types -Wswitch -Wswitch-bool -Wswitch-unreachable -Wsync-nand -Wtautological-compare -Wtrampolines -Wtrigraphs -Wtype-limits -Wuninitialized -Wunknown-pragmas -Wunused -Wunused-but-set-parameter -Wunused-but-set-variable -Wunused-function -Wunused-label -Wunused-local-typedefs -Wunused-parameter -Wunused-result -Wunused-value -Wunused-variable -Wvarargs -Wvariadic-macros -Wvector-operation-performance -Wvolatile-register-var -Wwrite-strings -Walloc-size-larger-than=9223372036854775807 -Warray-bounds=2 -Wformat-overflow=2 -Wformat-truncation=2 -Wimplicit-fallthrough=5 -Wnormalized=nfc -Wshift-overflow=2 -Wstringop-overflow=2 -Wunused-const-variable=2 -Wvla-larger-than=4031 -Wno-sign-compare -Wno-cast-function-type -Wjump-misses-init -Wswitch-enum -Wno-format-nonliteral -Wno-format-truncation -fstack-protector-strong -fexceptions -fasynchronous-unwind-tables -fipa-pure-const -Wno-suggest-attribute=pure -Wno-suggest-attribute=const -Werror -Wframe-larger-than=4096 -I../../src/remote -I../../src/rpc -I../../src/admin -I/usr/include/tirpc -I/usr/include/p11-kit-1 -g -O2 -DLIBXL_API_VERSION=0x040400 -Wl,--version-script=libvirt_admin.syms -version-info 4001:0:4001 -export-dynamic -Wl,-z -Wl,relro -Wl,-z -Wl,now -Wl,--no-copy-dt-needed-entries -o libvirt-admin.la -rpath /home/jenkins/build/libvirt/lib libvirt_admin_la-libvirt-admin.lo admin/libvirt_admin_la-admin_protocol.lo libvirt_admin_la-datatypes.lo libvirt.la -lcap-ng -lyajl -ldevmapper -lxml2 -lssh2 -lsasl2 -lgnutls -lssh libvirt_probes.lo -ltirpc -ldl )
libtool: install: /usr/bin/install -c .libs/libvirt-admin.so.0.4001.0T /home/jenkins/build/libvirt/lib/libvirt-admin.so.0.4001.0
libtool: install: (cd /home/jenkins/build/libvirt/lib && { ln -s -f libvirt-admin.so.0.4001.0 libvirt-admin.so.0 || { rm -f libvirt-admin.so.0 && ln -s libvirt-admin.so.0.4001.0 libvirt-admin.so.0; }; })
libtool: install: (cd /home/jenkins/build/libvirt/lib && { ln -s -f libvirt-admin.so.0.4001.0 libvirt-admin.so || { rm -f libvirt-admin.so && ln -s libvirt-admin.so.0.4001.0 libvirt-admin.so; }; })
libtool: install: /usr/bin/install -c .libs/libvirt-admin.lai /home/jenkins/build/libvirt/lib/libvirt-admin.la
libtool: finish: PATH="/home/jenkins/build/libvirt/bin:/home/jenkins/build/libvirt/bin:/home/jenkins/build/libvirt/bin:/home/jenkins/build/libvirt/bin:/usr/lib64/ccache:/usr/local/sbin:/usr/local/bin:/usr/sbin:/usr/bin:/home/jenkins/.local/bin:/home/jenkins/bin:/sbin" ldconfig -n /home/jenkins/build/libvirt/lib
ldconfig: Can't link /home/jenkins/build/libvirt/lib/libxkutil.so.0 to libxkutil.so.0.6.3
ldconfig: Can't link /home/jenkins/build/libvirt/lib/libvirt-sandbox-1.0.so.5 to libvirt-sandbox-1.0.so.5.6.1
ldconfig: Can't link /home/jenkins/build/libvirt/lib/libvirt-glib-1.0.so.0 to libvirt-glib-1.0.so.0.1001.0
ldconfig: Can't link /home/jenkins/build/libvirt/lib/libosinfo-1.0.so.0 to libosinfo-1.0.so.0.1002.0
ldconfig: Can't link /home/jenkins/build/libvirt/lib/libvirt-gconfig-1.0.so.0 to libvirt-gconfig-1.0.so.0.1001.0
ldconfig: Can't link /home/jenkins/build/libvirt/lib/libvirt-lxc.so.0 to libvirt-lxc.so.0.4001.0
ldconfig: Can't link /home/jenkins/build/libvirt/lib/libvirt.so.0 to libvirt.so.0.4001.0
ldconfig: Can't link /home/jenkins/build/libvirt/lib/libvirt-qemu.so.0 to libvirt-qemu.so.0.4001.0
ldconfig: Can't link /home/jenkins/build/libvirt/lib/libvirt-gobject-1.0.so.0 to libvirt-gobject-1.0.so.0.1001.0
ldconfig: Can't link /home/jenkins/build/libvirt/lib/libvirt-admin.so.0 to libvirt-admin.so.0.4001.0
----------------------------------------------------------------------
Libraries have been installed in:
   /home/jenkins/build/libvirt/lib

If you ever happen to want to link against installed libraries
in a given directory, LIBDIR, you must either use libtool, and
specify the full pathname of the library, or use the '-LLIBDIR'
flag during linking and do at least one of the following:
   - add LIBDIR to the 'LD_LIBRARY_PATH' environment variable
     during execution
   - add LIBDIR to the 'LD_RUN_PATH' environment variable
     during linking
   - use the '-Wl,-rpath -Wl,LIBDIR' linker flag
   - have your system administrator add LIBDIR to '/etc/ld.so.conf'

See any operating system documentation about shared libraries for
more information, such as the ld(1) and ld.so(8) manual pages.
----------------------------------------------------------------------
make[3]: Leaving directory '<https://ci.centos.org/job/libvirt-master-build/systems=libvirt-fedora-rawhide/ws/build/src'>
make[2]: *** [Makefile:11927: install-am] Error 2
make[2]: Leaving directory '<https://ci.centos.org/job/libvirt-master-build/systems=libvirt-fedora-rawhide/ws/build/src'>
make[1]: *** [Makefile:11921: install] Error 2
make[1]: Leaving directory '<https://ci.centos.org/job/libvirt-master-build/systems=libvirt-fedora-rawhide/ws/build/src'>
make: *** [Makefile:2125: install-recursive] Error 1
Build step 'Execute shell' marked build as failure


[Date Prev][Date Next]   [Thread Prev][Thread Next]   [Thread Index] [Date Index] [Author Index]