[Date Prev][Date Next]   [Thread Prev][Thread Next]   [Thread Index] [Date Index] [Author Index]

[Libvirt-ci] Build failed in Jenkins: virt-manager-ma ster-py3-check » libvirt-debian-9 #14



See <https://ci.centos.org/job/virt-manager-master-py3-check/systems=libvirt-debian-9/14/display/redirect>

------------------------------------------
Started by upstream project "virt-manager-master-py3-check" build number 14
originally caused by:
 Started by upstream project "virt-manager-master-py3-build" build number 14
 originally caused by:
  Started by an SCM change
[EnvInject] - Loading node environment variables.
Building remotely on libvirt-debian-9 (libvirt) in workspace <https://ci.centos.org/job/virt-manager-master-py3-check/systems=libvirt-debian-9/ws/>
[virt-manager-master] $ /bin/sh -xe /tmp/jenkins3940620727838286920.sh
+ MAKE=make
+ uname
+ unamestr=Linux
+ [ Linux = FreeBSD ]
+ export PATH=/home/jenkins/build/libvirt/bin:/home/jenkins/build/libvirt/bin:/home/jenkins/build/libvirt/bin:/home/jenkins/build/libvirt/bin:/usr/local/bin:/usr/bin:/bin:/usr/local/games:/usr/games
+ export PYTHONPATH=/home/jenkins/build/libvirt/lib/python3.4/site-packages:/home/jenkins/build/libvirt/lib64/python3.4/site-packages:/home/jenkins/build/libvirt/lib/python3.5/site-packages:/home/jenkins/build/libvirt/lib64/python3.5/site-packages:/home/jenkins/build/libvirt/lib/python3.6/site-packages:/home/jenkins/build/libvirt/lib64/python3.6/site-packages:/home/jenkins/build/libvirt/lib/python3.7/site-packages:/home/jenkins/build/libvirt/lib64/python3.7/site-packages
+ python3 ./setup.py test
running test
..............................................................................................................................F...............................................................................................................................................s........................................................................................................................................................................
======================================================================
FAIL: testCLI0002virt_install_singleton_config_2 (tests.clitest.CLITests)
----------------------------------------------------------------------
Traceback (most recent call last):
  File "<https://ci.centos.org/job/virt-manager-master-py3-check/systems=libvirt-debian-9/ws/tests/clitest.py";,> line 1110, in <lambda>
    return lambda s: cmdtemplate(s, cmd)
  File "<https://ci.centos.org/job/virt-manager-master-py3-check/systems=libvirt-debian-9/ws/tests/clitest.py";,> line 1109, in cmdtemplate
    _cmdobj.run(self)
  File "<https://ci.centos.org/job/virt-manager-master-py3-check/systems=libvirt-debian-9/ws/tests/clitest.py";,> line 277, in run
    tests.fail(err)
AssertionError: ./virt-install  --name foobar --ram 64 --print-step all --connect __virtinst_test__test:///<https://ci.centos.org/job/virt-manager-master-py3-check/systems=libvirt-debian-9/ws/tests/testdriver.xml,predictable,qemu,domcaps=/home/jenkins/virt-manager-master/tests/capabilities-xml/kvm-x86_64-domcaps.xml,caps=/home/jenkins/virt-manager-master/tests/capabilities-xml/kvm-x86_64.xml> --noautoconsole --os-variant fedora20 --pxe --memory 512,maxmemory=1024 --vcpus 4,cores=2,threads=2,sockets=2 --cpu foobar,+x2apic,+x2apicagain,-distest,forbid=foo,forbid=bar,disable=distest2,optional=opttest,require=reqtest,match=strict,vendor=meee,cell.id=0,cell.cpus=1,2,3,cell.memory=1024,cell1.id=1,cell1.memory=256,cell1.cpus=5-8,cell0.distances.sibling0.id=0,cell0.distances.sibling0.value=10,cell0.distances.sibling1.id=1,cell0.distances.sibling1.value=21,cell1.distances.sibling0.id=0,cell1.distances.sibling0.value=21,cell1.distances.sibling1.id=1,cell1.distances.sibling1.value=10,cache.mode=emulate,cache.level=3 --cputune vcpupin0.vcpu=0,vcpupin0.cpuset=0-3 --metadata title=my-title,description=my-description,uuid=00000000-1111-2222-3333-444444444444 --boot cdrom,fd,hd,network,menu=off,loader=/foo/bar --idmap uid_start=0,uid_target=1000,uid_count=10,gid_start=0,gid_target=1000,gid_count=10 --security type=static,label='system_u:object_r:svirt_image_t:s0:c100,c200',relabel=yes --numatune 1-3,4,mode=strict --memtune hard_limit=10,soft_limit=20,swap_hard_limit=30,min_guarantee=40 --blkiotune weight=100,device_path=/home/test/1.img,device_weight=200 --memorybacking size=1,unit='G',nodeset='1,2-5',nosharepages=yes,locked=yes --features acpi=off,eoi=on,privnet=on,hyperv_synic=on,hyperv_reset=on,hyperv_spinlocks=on,hyperv_spinlocks_retries=1234,vmport=off,pmu=off --clock offset=utc,hpet_present=no,rtc_tickpolicy=merge --sysinfo type=smbios,bios_vendor="Acme LLC",bios_version=1.2.3,bios_date=01/01/1970,bios_release=10.22 --sysinfo type=smbios,system_manufacturer="Acme Inc.",system_product=Computer,system_version=3.2.1,system_serial=123456789,system_uuid=00000000-1111-2222-3333-444444444444,system_sku=abc-123,system_family=Server --sysinfo type=smbios,baseBoard_manufacturer="Acme Corp.",baseBoard_product=Motherboard,baseBoard_version=A01,baseBoard_serial=1234-5678,baseBoard_asset=Tag,baseBoard_location=Chassis --pm suspend_to_mem=yes,suspend_to_disk=no --resource partition=/virtualmachines/production --events on_poweroff=destroy,on_reboot=restart,on_crash=preserve,on_lockfailure=ignore --controller usb3 --controller virtio-scsi --graphics vnc --filesystem /foo/source,/bar/target --memballoon virtio --watchdog ib700,action=pause --tpm passthrough,model=tpm-tis,path=/dev/tpm0 --rng egd,backend_host=127.0.0.1,backend_service=8000,backend_type=udp,backend_mode=bind,backend_connect_host=foo,backend_connect_service=708 --panic iobase=0x506 
Conversion outputs did not match.
--- tests/cli-test-xml/compare/virt-install-singleton-config-2.xml
+++ Generated Output
@@ -91,6 +91,7 @@
     <feature policy="disable" name="distest"/>
     <feature policy="forbid" name="foo"/>
     <feature policy="forbid" name="bar"/>
+    <cache mode="emulate" level="3"/>
     <numa>
       <cell id="0" cpus="1,2,3" memory="1024">
         <distances>
@@ -105,7 +106,6 @@
         </distances>
       </cell>
     </numa>
-    <cache mode="emulate" level="3"/>
   </cpu>
   <clock offset="utc">
     <timer name="rtc" tickpolicy="merge"/>
@@ -259,6 +259,7 @@
     <feature policy="disable" name="distest"/>
     <feature policy="forbid" name="foo"/>
     <feature policy="forbid" name="bar"/>
+    <cache mode="emulate" level="3"/>
     <numa>
       <cell id="0" cpus="1,2,3" memory="1024">
         <distances>
@@ -273,7 +274,6 @@
         </distances>
       </cell>
     </numa>
-    <cache mode="emulate" level="3"/>
   </cpu>
   <clock offset="utc">
     <timer name="rtc" tickpolicy="merge"/>


----------------------------------------------------------------------
Ran 439 tests in 68.582s

FAILED (failures=1, skipped=1)
Build step 'Execute shell' marked build as failure


[Date Prev][Date Next]   [Thread Prev][Thread Next]   [Thread Index] [Date Index] [Author Index]