[Date Prev][Date Next]   [Thread Prev][Thread Next]   [Thread Index] [Date Index] [Author Index]

[Libvirt-ci] Build failed in Jenkins: virt-manager-ma ster-check » libvirt-freebsd-11 #1062



See <https://ci.centos.org/job/virt-manager-master-check/systems=libvirt-freebsd-11/1062/display/redirect>

------------------------------------------
Started by upstream project "virt-manager-master-check" build number 1062
originally caused by:
 Started by upstream project "virt-manager-master-build" build number 1069
 originally caused by:
  Started by an SCM change
[EnvInject] - Loading node environment variables.
Building remotely on libvirt-freebsd-11 (libvirt) in workspace <https://ci.centos.org/job/virt-manager-master-check/systems=libvirt-freebsd-11/ws/>
[virt-manager-master] $ /bin/sh -xe /tmp/jenkins2925948091470727960.sh
+ MAKE=make
+ uname
+ unamestr=FreeBSD
+ [ FreeBSD '=' FreeBSD ]
+ MAKE=gmake
+ export 'PATH=/home/jenkins/build/libvirt/bin:/home/jenkins/build/libvirt/bin:/home/jenkins/build/libvirt/bin:/home/jenkins/build/libvirt/bin:/sbin:/bin:/usr/sbin:/usr/bin:/usr/local/sbin:/usr/local/bin:/home/jenkins/bin'
+ python2 setup.py test
running test
..............................................................................................................................................................................................................................................................................F........................................................................................................................................................................
======================================================================
FAIL: testCLI0146virt_install_location_iso (tests.clitest.CLITests)
----------------------------------------------------------------------
Traceback (most recent call last):
  File "/usr<https://ci.centos.org/job/virt-manager-master-check/systems=libvirt-freebsd-11/ws/tests/clitest.py";,> line 1096, in <lambda>
    return lambda s: cmdtemplate(s, cmd)
  File "/usr<https://ci.centos.org/job/virt-manager-master-check/systems=libvirt-freebsd-11/ws/tests/clitest.py";,> line 1095, in cmdtemplate
    _cmdobj.run(self)
  File "/usr<https://ci.centos.org/job/virt-manager-master-check/systems=libvirt-freebsd-11/ws/tests/clitest.py";,> line 271, in run
    tests.fail(err)
AssertionError: ./virt-install  --name foobar --ram 64 --print-step all --connect __virtinst_test__test:////usr<https://ci.centos.org/job/virt-manager-master-check/systems=libvirt-freebsd-11/ws/tests/testdriver.xml,predictable,qemu,domcaps=/usr/home/jenkins/virt-manager-master/tests/capabilities-xml/kvm-x86_64-domcaps.xml,caps=/usr/home/jenkins/virt-manager-master/tests/capabilities-xml/kvm-x86_64.xml> --noautoconsole --disk none --location /tmp/__virtinst_cli_exist1.img --nonetworks
Expected command to pass, but it didn't.
Command was: ./virt-install  --name foobar --ram 64 --print-step all --connect __virtinst_test__test:////usr<https://ci.centos.org/job/virt-manager-master-check/systems=libvirt-freebsd-11/ws/tests/testdriver.xml,predictable,qemu,domcaps=/usr/home/jenkins/virt-manager-master/tests/capabilities-xml/kvm-x86_64-domcaps.xml,caps=/usr/home/jenkins/virt-manager-master/tests/capabilities-xml/kvm-x86_64.xml> --noautoconsole --disk none --location /tmp/__virtinst_cli_exist1.img --nonetworks
Error code : -1
Output was:

Traceback (most recent call last):
  File "/usr<https://ci.centos.org/job/virt-manager-master-check/systems=libvirt-freebsd-11/ws/tests/clitest.py";,> line 158, in _launch_command
    ret = virtinstall.main(conn=conn)
  File "virt-install", line 998, in main
    xml = xml_to_print(guest, options.xmlonly, options.dry)
  File "virt-install", line 815, in xml_to_print
    start_xml, final_xml = guest.start_install(dry=dry, return_xml=True)
  File "/usr<https://ci.centos.org/job/virt-manager-master-check/systems=libvirt-freebsd-11/ws/virtinst/guest.py";,> line 478, in start_install
    self._prepare_install(meter, dry)
  File "/usr<https://ci.centos.org/job/virt-manager-master-check/systems=libvirt-freebsd-11/ws/virtinst/guest.py";,> line 311, in _prepare_install
    self.installer.prepare(self, meter)
  File "/usr<https://ci.centos.org/job/virt-manager-master-check/systems=libvirt-freebsd-11/ws/virtinst/installer.py";,> line 200, in prepare
    self._prepare(guest, meter)
  File "/usr<https://ci.centos.org/job/virt-manager-master-check/systems=libvirt-freebsd-11/ws/virtinst/distroinstaller.py";,> line 220, in _prepare
    self._prepare_kernel_url(guest, fetcher)
  File "/usr<https://ci.centos.org/job/virt-manager-master-check/systems=libvirt-freebsd-11/ws/virtinst/distroinstaller.py";,> line 127, in _prepare_kernel_url
    store = self._get_store(guest, fetcher)
  File "/usr<https://ci.centos.org/job/virt-manager-master-check/systems=libvirt-freebsd-11/ws/virtinst/distroinstaller.py";,> line 114, in _get_store
    self._cached_store = urlfetcher.getDistroStore(guest, fetcher)
  File "/usr<https://ci.centos.org/job/virt-manager-master-check/systems=libvirt-freebsd-11/ws/virtinst/urlfetcher.py";,> line 541, in getDistroStore
    if store.isValidStore():
  File "/usr<https://ci.centos.org/job/virt-manager-master-check/systems=libvirt-freebsd-11/ws/virtinst/urlfetcher.py";,> line 1248, in isValidStore
    self._is_install_cd,
  File "/usr<https://ci.centos.org/job/virt-manager-master-check/systems=libvirt-freebsd-11/ws/virtinst/urlfetcher.py";,> line 1245, in <genexpr>
    return any(check() for check in [
  File "/usr<https://ci.centos.org/job/virt-manager-master-check/systems=libvirt-freebsd-11/ws/virtinst/urlfetcher.py";,> line 1198, in _is_regular_tree
    if not self._check_manifest("current/images/MANIFEST"):
  File "/usr<https://ci.centos.org/job/virt-manager-master-check/systems=libvirt-freebsd-11/ws/virtinst/urlfetcher.py";,> line 1170, in _check_manifest
    if not self.fetcher.hasFile(filename):
  File "/usr<https://ci.centos.org/job/virt-manager-master-check/systems=libvirt-freebsd-11/ws/virtinst/urlfetcher.py";,> line 143, in hasFile
    ret = self._hasFile(url)
  File "/usr<https://ci.centos.org/job/virt-manager-master-check/systems=libvirt-freebsd-11/ws/virtinst/urlfetcher.py";,> line 358, in _hasFile
    output = subprocess.check_output(cmd)
  File "/usr/local/lib/python2.7/subprocess.py", line 212, in check_output
    process = Popen(stdout=PIPE, *popenargs, **kwargs)
  File "/usr/local/lib/python2.7/subprocess.py", line 390, in __init__
    errread, errwrite)
  File "/usr/local/lib/python2.7/subprocess.py", line 1025, in _execute_child
    raise child_exception
OSError: [Errno 2] No such file or directory

----------------------------------------------------------------------
Ran 439 tests in 106.576s

FAILED (failures=1)
Build step 'Execute shell' marked build as failure


[Date Prev][Date Next]   [Thread Prev][Thread Next]   [Thread Index] [Date Index] [Author Index]