[Date Prev][Date Next]   [Thread Prev][Thread Next]   [Thread Index] [Date Index] [Author Index]

[Libvirt-ci] Build failed in Jenkins: libvirt-dbus-ma ster-check » libvirt-fedora-rawhide #246



See <https://ci.centos.org/job/libvirt-dbus-master-check/systems=libvirt-fedora-rawhide/246/display/redirect>

------------------------------------------
Started by upstream project "libvirt-dbus-master-check" build number 246
originally caused by:
 Started by upstream project "libvirt-dbus-master-build" build number 280
 originally caused by:
  Started by upstream project "libvirt-glib-master-build" build number 1247
  originally caused by:
   Started by upstream project "libvirt-master-build" build number 1573
   originally caused by:
    Started by an SCM change
[EnvInject] - Loading node environment variables.
Building remotely on libvirt-fedora-rawhide (libvirt) in workspace <https://ci.centos.org/job/libvirt-dbus-master-check/systems=libvirt-fedora-rawhide/ws/>
[libvirt-dbus-master] $ /bin/sh -xe /tmp/jenkins5785380208717419341.sh
+ cd build
+ /usr/bin/gmake check
Making check in data
gmake[1]: Entering directory '<https://ci.centos.org/job/libvirt-dbus-master-check/systems=libvirt-fedora-rawhide/ws/build/data'>
gmake[1]: Nothing to be done for 'check'.
gmake[1]: Leaving directory '<https://ci.centos.org/job/libvirt-dbus-master-check/systems=libvirt-fedora-rawhide/ws/build/data'>
Making check in docs
gmake[1]: Entering directory '<https://ci.centos.org/job/libvirt-dbus-master-check/systems=libvirt-fedora-rawhide/ws/build/docs'>
gmake[1]: Nothing to be done for 'check'.
gmake[1]: Leaving directory '<https://ci.centos.org/job/libvirt-dbus-master-check/systems=libvirt-fedora-rawhide/ws/build/docs'>
Making check in src
gmake[1]: Entering directory '<https://ci.centos.org/job/libvirt-dbus-master-check/systems=libvirt-fedora-rawhide/ws/build/src'>
gmake[1]: Nothing to be done for 'check'.
gmake[1]: Leaving directory '<https://ci.centos.org/job/libvirt-dbus-master-check/systems=libvirt-fedora-rawhide/ws/build/src'>
Making check in tests
gmake[1]: Entering directory '<https://ci.centos.org/job/libvirt-dbus-master-check/systems=libvirt-fedora-rawhide/ws/build/tests'>
/usr/bin/gmake  test_util
gmake[2]: Entering directory '<https://ci.centos.org/job/libvirt-dbus-master-check/systems=libvirt-fedora-rawhide/ws/build/tests'>
  CC       test_util-test_util.o
  CCLD     test_util
gmake[2]: Leaving directory '<https://ci.centos.org/job/libvirt-dbus-master-check/systems=libvirt-fedora-rawhide/ws/build/tests'>
/usr/bin/gmake  check-TESTS
gmake[2]: Entering directory '<https://ci.centos.org/job/libvirt-dbus-master-check/systems=libvirt-fedora-rawhide/ws/build/tests'>
gmake[3]: Entering directory '<https://ci.centos.org/job/libvirt-dbus-master-check/systems=libvirt-fedora-rawhide/ws/build/tests'>
PASS: test_util
PASS: test_network.py
FAIL: test_connect.py
PASS: test_domain.py
PASS: test_nodedev.py
PASS: test_storage.py
============================================================================
Testsuite summary for libvirt-dbus 1.2.0
============================================================================
# TOTAL: 6
# PASS:  5
# SKIP:  0
# XFAIL: 0
# FAIL:  1
# XPASS: 0
# ERROR: 0
============================================================================
See tests/test-suite.log
Please report to libvir-list redhat com
============================================================================
gmake[3]: *** [Makefile:764: test-suite.log] Error 1
gmake[3]: Leaving directory '<https://ci.centos.org/job/libvirt-dbus-master-check/systems=libvirt-fedora-rawhide/ws/build/tests'>
gmake[2]: *** [Makefile:872: check-TESTS] Error 2
gmake[2]: Leaving directory '<https://ci.centos.org/job/libvirt-dbus-master-check/systems=libvirt-fedora-rawhide/ws/build/tests'>
gmake[1]: *** [Makefile:981: check-am] Error 2
gmake[1]: Leaving directory '<https://ci.centos.org/job/libvirt-dbus-master-check/systems=libvirt-fedora-rawhide/ws/build/tests'>
gmake: *** [Makefile:459: check-recursive] Error 1
+ cat tests/test-suite.log
==============================================
   libvirt-dbus 1.2.0: tests/test-suite.log
==============================================

# TOTAL: 6
# PASS:  5
# SKIP:  0
# XFAIL: 0
# FAIL:  1
# XPASS: 0
# ERROR: 0

.. contents:: :depth: 2

FAIL: test_connect.py
=====================

============================= test session starts ==============================
platform linux -- Python 3.6.5, pytest-3.6.2, py-1.5.4, pluggy-0.6.0
rootdir: <https://ci.centos.org/job/libvirt-dbus-master-check/systems=libvirt-fedora-rawhide/ws/,> inifile:
collected 32 items

../../tests/test_connect.py ..E............................E             [100%]

==================================== ERRORS ====================================
 ERROR at setup of TestConnect.test_connect_domain_lookup_by_id[DomainLookupByID-Id] 

self = <test_connect.TestConnect object at 0x7efe68e217b8>
request = <SubRequest 'libvirt_dbus_setup' for <Function 'test_connect_domain_lookup_by_id[DomainLookupByID-Id]'>>

    @pytest.fixture(autouse=True)
    def libvirt_dbus_setup(self, request):
        """Start libvirt-dbus for each test function
            """
        os.environ['LIBVIRT_DEBUG'] = '3'
        self.libvirt_dbus = subprocess.Popen([exe])
        self.bus = dbus.SessionBus()
    
        for i in range(10):
            if self.bus.name_has_owner('org.libvirt'):
                break
            time.sleep(0.1)
        else:
>           raise TimeoutError('error starting libvirt-dbus')
E           TimeoutError: error starting libvirt-dbus

../../tests/libvirttest.py:44: TimeoutError
 ERROR at setup of TestConnect.test_connect_storage_vol_lookup_by_property[StorageVolLookupByPath-Path] 

self = <test_connect.TestConnect object at 0x7efe68e6c240>

    @pytest.fixture
    def storage_volume_create(self):
        """ Fixture to create dummy storage volume on the test driver
    
            This fixture should be used in the setup of every test manipulating
            with test volume.
            """
        _, test_storage_pool = self.get_test_storage_pool()
        interface_obj = dbus.Interface(test_storage_pool,
                                       'org.libvirt.StoragePool')
>       path = interface_obj.StorageVolCreateXML(xmldata.minimal_storage_vol_xml, 0)

../../tests/libvirttest.py:94: 
_ _ _ _ _ _ _ _ _ _ _ _ _ _ _ _ _ _ _ _ _ _ _ _ _ _ _ _ _ _ _ _ _ _ _ _ _ _ _ _ 
/usr/lib64/python3.6/site-packages/dbus/proxies.py:70: in __call__
    return self._proxy_method(*args, **keywords)
/usr/lib64/python3.6/site-packages/dbus/proxies.py:145: in __call__
    **keywords)
_ _ _ _ _ _ _ _ _ _ _ _ _ _ _ _ _ _ _ _ _ _ _ _ _ _ _ _ _ _ _ _ _ _ _ _ _ _ _ _ 

self = <dbus._dbus.SessionBus (session) at 0x7efe68db6308>
bus_name = dbus.String(':1.3')
object_path = dbus.ObjectPath('/org/libvirt/Test/storagepool/_35bb2ad9_388a_cdfe_461a_b8907f6e53fe')
dbus_interface = 'org.libvirt.StoragePool', method = 'StorageVolCreateXML'
signature = 'su'
args = ('\n<volume>\n  <name>sparse.img</name>\n  <capacity unit="G">2</capacity>\n  <target>\n    <path>/var/lib/virt/images/sparse.img</path>\n  </target>\n</volume>\n', 0)
timeout = -1.0, byte_arrays = False, kwargs = {}
get_args_opts = {'byte_arrays': False}
message = <dbus.lowlevel.MethodCallMessage path: /org/libvirt/Test/storagepool/_35bb2ad9_388a_cdfe_461a_b8907f6e53fe, iface: org.libvirt.StoragePool, member: StorageVolCreateXML dest: :1.3>

    def call_blocking(self, bus_name, object_path, dbus_interface, method,
                      signature, args, timeout=-1.0,
                      byte_arrays=False, **kwargs):
        """Call the given method, synchronously.
            :Since: 0.81.0
            """
        if object_path == LOCAL_PATH:
            raise DBusException('Methods may not be called on the reserved '
                                'path %s' % LOCAL_PATH)
        if dbus_interface == LOCAL_IFACE:
            raise DBusException('Methods may not be called on the reserved '
                                'interface %s' % LOCAL_IFACE)
        # no need to validate other args - MethodCallMessage ctor will do
    
        get_args_opts = dict(byte_arrays=byte_arrays)
        if is_py2:
            get_args_opts['utf8_strings'] = kwargs.get('utf8_strings', False)
        elif 'utf8_strings' in kwargs:
            raise TypeError("unexpected keyword argument 'utf8_strings'")
    
        message = MethodCallMessage(destination=bus_name,
                                    path=object_path,
                                    interface=dbus_interface,
                                    method=method)
        # Add the arguments to the function
        try:
            message.append(signature=signature, *args)
        except Exception as e:
            logging.basicConfig()
            _logger.error('Unable to set arguments %r according to '
                          'signature %r: %s: %s',
                          args, signature, e.__class__, e)
            raise
    
        # make a blocking call
        reply_message = self.send_message_with_reply_and_block(
>           message, timeout)
E       dbus.exceptions.DBusException: org.libvirt.Error: operation failed: storage vol already exists

/usr/lib64/python3.6/site-packages/dbus/connection.py:651: DBusException
====================== 30 passed, 2 error in 8.42 seconds ======================
FAIL test_connect.py (exit status: 1)

+ exit 1
Build step 'Execute shell' marked build as failure


[Date Prev][Date Next]   [Thread Prev][Thread Next]   [Thread Index] [Date Index] [Author Index]