[Date Prev][Date Next]   [Thread Prev][Thread Next]   [Thread Index] [Date Index] [Author Index]

[Libvirt-ci] Build failed in Jenkins: libosinfo-maste r-check » libvirt-fedora-rawhide #141



See <https://ci.centos.org/job/libosinfo-master-check/systems=libvirt-fedora-rawhide/141/display/redirect>

------------------------------------------
Started by upstream project "libosinfo-master-check" build number 141
originally caused by:
 Started by upstream project "libosinfo-master-syntax-check" build number 145
 originally caused by:
  Started by upstream project "libosinfo-master-build" build number 165
  originally caused by:
   Started by an SCM change
[EnvInject] - Loading node environment variables.
Building remotely on libvirt-fedora-rawhide (libvirt) in workspace <https://ci.centos.org/job/libosinfo-master-check/systems=libvirt-fedora-rawhide/ws/>
[libosinfo-master] $ /bin/sh -xe /tmp/jenkins3325387011682515475.sh
+ cd build
+ /usr/bin/gmake check
  GEN      public-submodule-commit
Making check in osinfo
gmake[1]: Entering directory '<https://ci.centos.org/job/libosinfo-master-check/systems=libvirt-fedora-rawhide/ws/build/osinfo'>
/usr/bin/gmake  check-am
gmake[2]: Entering directory '<https://ci.centos.org/job/libosinfo-master-check/systems=libvirt-fedora-rawhide/ws/build/osinfo'>
/usr/bin/gmake  check-local
gmake[3]: Entering directory '<https://ci.centos.org/job/libosinfo-master-check/systems=libvirt-fedora-rawhide/ws/build/osinfo'>
  GEN      check-symfile
  GEN      check-symsorting
gmake[3]: Leaving directory '<https://ci.centos.org/job/libosinfo-master-check/systems=libvirt-fedora-rawhide/ws/build/osinfo'>
gmake[2]: Leaving directory '<https://ci.centos.org/job/libosinfo-master-check/systems=libvirt-fedora-rawhide/ws/build/osinfo'>
gmake[1]: Leaving directory '<https://ci.centos.org/job/libosinfo-master-check/systems=libvirt-fedora-rawhide/ws/build/osinfo'>
Making check in tools
gmake[1]: Entering directory '<https://ci.centos.org/job/libosinfo-master-check/systems=libvirt-fedora-rawhide/ws/build/tools'>
gmake[1]: Nothing to be done for 'check'.
gmake[1]: Leaving directory '<https://ci.centos.org/job/libosinfo-master-check/systems=libvirt-fedora-rawhide/ws/build/tools'>
Making check in docs
gmake[1]: Entering directory '<https://ci.centos.org/job/libosinfo-master-check/systems=libvirt-fedora-rawhide/ws/build/docs'>
Making check in reference
gmake[2]: Entering directory '<https://ci.centos.org/job/libosinfo-master-check/systems=libvirt-fedora-rawhide/ws/build/docs/reference'>
gmake[2]: Nothing to be done for 'check'.
gmake[2]: Leaving directory '<https://ci.centos.org/job/libosinfo-master-check/systems=libvirt-fedora-rawhide/ws/build/docs/reference'>
gmake[2]: Entering directory '<https://ci.centos.org/job/libosinfo-master-check/systems=libvirt-fedora-rawhide/ws/build/docs'>
gmake[2]: Nothing to be done for 'check-am'.
gmake[2]: Leaving directory '<https://ci.centos.org/job/libosinfo-master-check/systems=libvirt-fedora-rawhide/ws/build/docs'>
gmake[1]: Leaving directory '<https://ci.centos.org/job/libosinfo-master-check/systems=libvirt-fedora-rawhide/ws/build/docs'>
Making check in po
gmake[1]: Entering directory '<https://ci.centos.org/job/libosinfo-master-check/systems=libvirt-fedora-rawhide/ws/build/po'>
INTLTOOL_EXTRACT="/usr/bin/intltool-extract" XGETTEXT="/usr/bin/xgettext" srcdir=../../po /usr/bin/intltool-update --gettext-package libosinfo --pot
rm -f missing notexist
srcdir=../../po /usr/bin/intltool-update -m
if [ -r missing -o -r notexist ]; then \
  exit 1; \
fi
gmake[1]: Leaving directory '<https://ci.centos.org/job/libosinfo-master-check/systems=libvirt-fedora-rawhide/ws/build/po'>
Making check in examples
gmake[1]: Entering directory '<https://ci.centos.org/job/libosinfo-master-check/systems=libvirt-fedora-rawhide/ws/build/examples'>
gmake[1]: Nothing to be done for 'check'.
gmake[1]: Leaving directory '<https://ci.centos.org/job/libosinfo-master-check/systems=libvirt-fedora-rawhide/ws/build/examples'>
Making check in tests
gmake[1]: Entering directory '<https://ci.centos.org/job/libosinfo-master-check/systems=libvirt-fedora-rawhide/ws/build/tests'>
/usr/bin/gmake  test-entity test-device test-list test-devicelist test-filter test-product test-os test-oslist test-productfilter test-platform test-platformlist test-db test-loader test-isodetect test-install-script test-os-resources test-mediauris test-treeuris
gmake[2]: Entering directory '<https://ci.centos.org/job/libosinfo-master-check/systems=libvirt-fedora-rawhide/ws/build/tests'>
  CC       test_entity-test-entity.o
  CC       test_list-test-list.o
  CC       test_device-test-device.o
  CC       test_devicelist-test-devicelist.o
  CC       test_filter-test-filter.o
  CC       test_product-test-product.o
  CC       test_os-test-os.o
  CC       test_oslist-test-oslist.o
  CC       test_productfilter-test-productfilter.o
  CC       test_platform-test-platform.o
  CC       test_platformlist-test-platformlist.o
  CC       test_db-test-db.o
  CC       test_loader-test-loader.o
  CC       test_isodetect-test-isodetect.o
  CC       test_install_script-test-install-script.o
  CC       test_os_resources-test-os-resources.o
  CC       test_mediauris-test-mediauris.o
  CCLD     test-entity
  CC       test_treeuris-test-treeuris.o
  CCLD     test-device
  CCLD     test-list
  CCLD     test-devicelist
  CCLD     test-filter
  CCLD     test-product
  CCLD     test-os
  CCLD     test-oslist
  CCLD     test-productfilter
  CCLD     test-platform
  CCLD     test-platformlist
  CCLD     test-db
  CCLD     test-loader
  CCLD     test-isodetect
  CCLD     test-install-script
  CCLD     test-os-resources
  CCLD     test-mediauris
  CCLD     test-treeuris
gmake[2]: Leaving directory '<https://ci.centos.org/job/libosinfo-master-check/systems=libvirt-fedora-rawhide/ws/build/tests'>
/usr/bin/gmake  check-TESTS
gmake[2]: Entering directory '<https://ci.centos.org/job/libosinfo-master-check/systems=libvirt-fedora-rawhide/ws/build/tests'>
gmake[3]: Entering directory '<https://ci.centos.org/job/libosinfo-master-check/systems=libvirt-fedora-rawhide/ws/build/tests'>
PASS: test-device
PASS: test-list
PASS: test-entity
PASS: test-devicelist
PASS: test-filter
PASS: test-product
PASS: test-oslist
PASS: test-os
PASS: test-productfilter
PASS: test-platformlist
PASS: test-platform
PASS: test-db
PASS: test-install-script
PASS: test-loader
SKIP: test-mediauris
PASS: test-os-resources
SKIP: test-treeuris
../../build-aux/test-driver: line 107: 22171 Trace/breakpoint trap   (core dumped) "$@" > $log_file 2>&1
FAIL: test-isodetect
============================================================================
Testsuite summary for libosinfo 1.3.0
============================================================================
# TOTAL: 18
# PASS:  15
# SKIP:  2
# XFAIL: 0
# FAIL:  1
# XPASS: 0
# ERROR: 0
============================================================================
See tests/test-suite.log
Please report to libosinfo redhat com
============================================================================
gmake[3]: *** [Makefile:1313: test-suite.log] Error 1
gmake[3]: Leaving directory '<https://ci.centos.org/job/libosinfo-master-check/systems=libvirt-fedora-rawhide/ws/build/tests'>
gmake[2]: *** [Makefile:1421: check-TESTS] Error 2
gmake[2]: Leaving directory '<https://ci.centos.org/job/libosinfo-master-check/systems=libvirt-fedora-rawhide/ws/build/tests'>
gmake[1]: *** [Makefile:1614: check-am] Error 2
gmake[1]: Leaving directory '<https://ci.centos.org/job/libosinfo-master-check/systems=libvirt-fedora-rawhide/ws/build/tests'>
gmake: *** [Makefile:594: check-recursive] Error 1
+ cat tests/test-suite.log
===========================================
   libosinfo 1.3.0: tests/test-suite.log
===========================================

# TOTAL: 18
# PASS:  15
# SKIP:  2
# XFAIL: 0
# FAIL:  1
# XPASS: 0
# ERROR: 0

.. contents:: :depth: 2

FAIL: test-isodetect
====================

/isodetect/alpinelinux: OK
/isodetect/windows: OK
/isodetect/ubuntu: OK
/isodetect/sles: 
** (<https://ci.centos.org/job/libosinfo-master-check/systems=libvirt-fedora-rawhide/ws/build/tests/.libs/lt-test-isodetect>:22171): ERROR **: 21:51:53.996: ISO SLE-15-Installer-DVD-aarch64-GM-DVD1.iso.txt was not matched by OS sle15
FAIL test-isodetect (exit status: 133)

SKIP: test-mediauris
====================

SKIP test-mediauris (exit status: 77)

SKIP: test-treeuris
===================

SKIP test-treeuris (exit status: 77)

+ exit 1
Build step 'Execute shell' marked build as failure


[Date Prev][Date Next]   [Thread Prev][Thread Next]   [Thread Index] [Date Index] [Author Index]