[Date Prev][Date Next]   [Thread Prev][Thread Next]   [Thread Index] [Date Index] [Author Index]

[Libvirt-ci] Build failed in Jenkins: libvirt-master- check » libvirt-freebsd-11 #1266



See <https://ci.centos.org/job/libvirt-master-check/systems=libvirt-freebsd-11/1266/display/redirect>

------------------------------------------
[...truncated 23.17 KB...]
gmake[3]: Leaving directory '/usr<https://ci.centos.org/job/libvirt-master-check/systems=libvirt-freebsd-11/ws/build/gnulib/tests'>
gmake[2]: Leaving directory '/usr<https://ci.centos.org/job/libvirt-master-check/systems=libvirt-freebsd-11/ws/build/gnulib/tests'>
gmake[1]: Leaving directory '/usr<https://ci.centos.org/job/libvirt-master-check/systems=libvirt-freebsd-11/ws/build/gnulib/tests'>
Making check in tests
gmake[1]: Entering directory '/usr<https://ci.centos.org/job/libvirt-master-check/systems=libvirt-freebsd-11/ws/build/tests'>
/usr/local/bin/gmake   
gmake[2]: Entering directory '/usr<https://ci.centos.org/job/libvirt-master-check/systems=libvirt-freebsd-11/ws/build/tests'>
gmake[2]: Nothing to be done for 'all'.
gmake[2]: Leaving directory '/usr<https://ci.centos.org/job/libvirt-master-check/systems=libvirt-freebsd-11/ws/build/tests'>
/usr/local/bin/gmake  check-TESTS
gmake[2]: Entering directory '/usr<https://ci.centos.org/job/libvirt-master-check/systems=libvirt-freebsd-11/ws/build/tests'>
gmake[3]: Entering directory '/usr<https://ci.centos.org/job/libvirt-master-check/systems=libvirt-freebsd-11/ws/build/tests'>
PASS: sockettest
PASS: virbuftest
SKIP: virhostcputest
PASS: seclabeltest
PASS: virhashtest
PASS: virconftest
PASS: commandtest
PASS: utiltest
SKIP: shunloadtest
PASS: virtimetest
PASS: viruritest
PASS: virkeyfiletest
PASS: viralloctest
PASS: virauthconfigtest
PASS: virbitmaptest
SKIP: vircgrouptest
PASS: vircryptotest
SKIP: virpcitest
PASS: virendiantest
PASS: virfiletest
PASS: virfilecachetest
SKIP: virfirewalltest
FAIL: viriscsitest
PASS: virkeycodetest
PASS: virlockspacetest
PASS: viratomictest
PASS: virlogtest
PASS: virrotatingfiletest
PASS: virstringtest
SKIP: virportallocatortest
PASS: sysinfotest
SKIP: virkmodtest
PASS: vircapstest
PASS: domaincapstest
PASS: domainconftest
SKIP: virhostdevtest
SKIP: virnetdevtest
PASS: virtypedparamtest
PASS: virnetmessagetest
PASS: virnetsockettest
PASS: virnetdaemontest
PASS: virnetserverclienttest
SKIP: virnettlscontexttest
SKIP: virnettlssessiontest
PASS: fdstreamtest
PASS: virdbustest
SKIP: virsystemdtest
PASS: virpolkittest
PASS: qemuxml2argvtest
PASS: qemuxml2xmltest
PASS: qemuargv2xmltest
PASS: domainsnapshotxml2xmltest
PASS: qemumonitorjsontest
PASS: virschematest
PASS: qemuagenttest
PASS: qemuhotplugtest
PASS: qemucaps2xmltest
PASS: qemumemlocktest
PASS: qemucommandutiltest
PASS: qemublocktest
PASS: qemumigparamstest
PASS: esxutilstest
PASS: qemucapabilitiestest
PASS: vboxsnapshotxmltest
PASS: vmx2xmltest
PASS: vmwarevertest
PASS: xml2vmxtest
PASS: bhyvexml2xmltest
PASS: bhyvexml2argvtest
PASS: virjsontest
PASS: networkxml2xmltest
PASS: bhyveargv2xmltest
PASS: networkxml2conftest
PASS: networkxml2xmlupdatetest
SKIP: networkxml2firewalltest
PASS: virnwfilterbindingxml2xmltest
PASS: storagevolxml2argvtest
PASS: nwfilterxml2xmltest
PASS: virstorageutiltest
PASS: nsstest
PASS: nssguesttest
PASS: storagevolxml2xmltest
PASS: storagepoolxml2xmltest
PASS: nodedevxml2xmltest
PASS: interfacexml2xmltest
PASS: metadatatest
PASS: secretxml2xmltest
PASS: genericxml2xmltest
PASS: eventtest
PASS: virdrivermoduletest
PASS: objecteventtest
PASS: virmacmaptest
PASS: libvirtd-fail
PASS: libvirtd-pool
PASS: virsh-cpuset
PASS: virsh-define-dev-segfault
PASS: virsh-int-overflow
SKIP: virsh-optparse
PASS: virsh-read-bufsiz
PASS: virsh-read-non-seekable
PASS: virsh-schedinfo
PASS: virsh-self-test
PASS: cputest
PASS: virsh-start
PASS: virt-admin-self-test
PASS: virsh-undefine
PASS: virsh-uriprecedence
PASS: virsh-vcpupin
PASS: virshtest
============================================================================
Testsuite summary for libvirt 4.6.0
============================================================================
# TOTAL: 109
# PASS:  94
# SKIP:  14
# XFAIL: 0
# FAIL:  1
# XPASS: 0
# ERROR: 0
============================================================================
See tests/test-suite.log
Please report to libvir-list redhat com
============================================================================
gmake[3]: *** [Makefile:5818: test-suite.log] Error 1
gmake[3]: Leaving directory '/usr<https://ci.centos.org/job/libvirt-master-check/systems=libvirt-freebsd-11/ws/build/tests'>
gmake[2]: *** [Makefile:5926: check-TESTS] Error 2
gmake[2]: Leaving directory '/usr<https://ci.centos.org/job/libvirt-master-check/systems=libvirt-freebsd-11/ws/build/tests'>
gmake[1]: *** [Makefile:6924: check-am] Error 2
gmake[1]: Leaving directory '/usr<https://ci.centos.org/job/libvirt-master-check/systems=libvirt-freebsd-11/ws/build/tests'>
gmake: *** [Makefile:2106: check-recursive] Error 1
+ cat tests/test-suite.log
=========================================
   libvirt 4.6.0: tests/test-suite.log
=========================================

# TOTAL: 109
# PASS:  94
# SKIP:  14
# XFAIL: 0
# FAIL:  1
# XPASS: 0
# ERROR: 0

.. contents:: :depth: 2

SKIP: virhostcputest
====================

SKIP virhostcputest (exit status: 77)

SKIP: shunloadtest
==================

SKIP shunloadtest (exit status: 77)

SKIP: vircgrouptest
===================

SKIP vircgrouptest (exit status: 77)

SKIP: virpcitest
================

SKIP virpcitest (exit status: 77)

SKIP: virfirewalltest
=====================

SKIP virfirewalltest (exit status: 77)

FAIL: viriscsitest
==================

TEST: viriscsitest
 1) ISCSI get session testiqn.2004-06.example:example1:iscsi.test     ... OK
 2) ISCSI get (non-flash) session testiqn.2004-06.example:example1:iscsi.test ... OK
 3) ISCSI get session testiqn.2009-04.example:example1:iscsi.seven    ... OK
 4) ISCSI get (non-flash) session testiqn.2009-04.example:example1:iscsi.seven ... OK
 5) ISCSI get session testiqn.2009-04.example:example1:iscsi.eight    ... OK
 6) ISCSI get (non-flash) session testiqn.2009-04.example:example1:iscsi.eight ... OK
 7) ISCSI scan targets                                                ... OK
 8) ISCSI login 10.20.30.40:3260,1                                    ... OK
 9) ISCSI login 10.20.30.40:3260,1                                    ... libvirt:  error : internal error: malformed output of iscsiadm: default tcp,<empty>,<empty>,<empty>,<empty>
FAILED
FAIL viriscsitest (exit status: 1)

SKIP: virportallocatortest
==========================

SKIP virportallocatortest (exit status: 77)

SKIP: virkmodtest
=================

SKIP virkmodtest (exit status: 77)

SKIP: virhostdevtest
====================

SKIP virhostdevtest (exit status: 77)

SKIP: virnetdevtest
===================

SKIP virnetdevtest (exit status: 77)

SKIP: virnettlscontexttest
==========================

SKIP virnettlscontexttest (exit status: 77)

SKIP: virnettlssessiontest
==========================

SKIP virnettlssessiontest (exit status: 77)

SKIP: virsystemdtest
====================

SKIP virsystemdtest (exit status: 77)

SKIP: networkxml2firewalltest
=============================

SKIP networkxml2firewalltest (exit status: 77)

SKIP: virsh-optparse
====================

../../tests/virsh-optparse: skipping test: 
This test is very expensive, so it is disabled by default.
To run it anyway, rerun: make check VIR_TEST_EXPENSIVE=1

SKIP virsh-optparse (exit status: 77)

+ exit 1
Build step 'Execute shell' marked build as failure


[Date Prev][Date Next]   [Thread Prev][Thread Next]   [Thread Index] [Date Index] [Author Index]