[Date Prev][Date Next]   [Thread Prev][Thread Next]   [Thread Index] [Date Index] [Author Index]

[Libvirt-ci] Build failed in Jenkins: libvirt-dbus-ma ster-check » libvirt-freebsd-10 #302



See <https://ci.centos.org/job/libvirt-dbus-master-check/systems=libvirt-freebsd-10/302/display/redirect>

------------------------------------------
Started by upstream project "libvirt-dbus-master-check" build number 302
originally caused by:
 Started by upstream project "libvirt-dbus-master-build" build number 336
 originally caused by:
  Started by upstream project "libvirt-glib-master-build" build number 1297
  originally caused by:
   Started by upstream project "libvirt-master-build" build number 1626
   originally caused by:
    Started by an SCM change
[EnvInject] - Loading node environment variables.
Building remotely on libvirt-freebsd-10 (libvirt) in workspace <https://ci.centos.org/job/libvirt-dbus-master-check/systems=libvirt-freebsd-10/ws/>
[libvirt-dbus-master] $ /bin/sh -xe /tmp/jenkins7498927579077394962.sh
+ cd build
+ /usr/local/bin/gmake check
Making check in data
gmake[1]: Entering directory '/usr<https://ci.centos.org/job/libvirt-dbus-master-check/systems=libvirt-freebsd-10/ws/build/data'>
gmake[1]: Nothing to be done for 'check'.
gmake[1]: Leaving directory '/usr<https://ci.centos.org/job/libvirt-dbus-master-check/systems=libvirt-freebsd-10/ws/build/data'>
Making check in docs
gmake[1]: Entering directory '/usr<https://ci.centos.org/job/libvirt-dbus-master-check/systems=libvirt-freebsd-10/ws/build/docs'>
gmake[1]: Nothing to be done for 'check'.
gmake[1]: Leaving directory '/usr<https://ci.centos.org/job/libvirt-dbus-master-check/systems=libvirt-freebsd-10/ws/build/docs'>
Making check in src
gmake[1]: Entering directory '/usr<https://ci.centos.org/job/libvirt-dbus-master-check/systems=libvirt-freebsd-10/ws/build/src'>
gmake[1]: Nothing to be done for 'check'.
gmake[1]: Leaving directory '/usr<https://ci.centos.org/job/libvirt-dbus-master-check/systems=libvirt-freebsd-10/ws/build/src'>
Making check in tests
gmake[1]: Entering directory '/usr<https://ci.centos.org/job/libvirt-dbus-master-check/systems=libvirt-freebsd-10/ws/build/tests'>
/usr/local/bin/gmake  test_util
gmake[2]: Entering directory '/usr<https://ci.centos.org/job/libvirt-dbus-master-check/systems=libvirt-freebsd-10/ws/build/tests'>
  CC       test_util-test_util.o
  CCLD     test_util
gmake[2]: Leaving directory '/usr<https://ci.centos.org/job/libvirt-dbus-master-check/systems=libvirt-freebsd-10/ws/build/tests'>
/usr/local/bin/gmake  check-TESTS
gmake[2]: Entering directory '/usr<https://ci.centos.org/job/libvirt-dbus-master-check/systems=libvirt-freebsd-10/ws/build/tests'>
gmake[3]: Entering directory '/usr<https://ci.centos.org/job/libvirt-dbus-master-check/systems=libvirt-freebsd-10/ws/build/tests'>
PASS: test_util
FAIL: test_interface.py
PASS: test_network.py
PASS: test_domain.py
PASS: test_nodedev.py
PASS: test_storage.py
PASS: test_connect.py
============================================================================
Testsuite summary for libvirt-dbus 1.3.0
============================================================================
# TOTAL: 7
# PASS:  6
# SKIP:  0
# XFAIL: 0
# FAIL:  1
# XPASS: 0
# ERROR: 0
============================================================================
See tests/test-suite.log
Please report to libvir-list redhat com
============================================================================
gmake[3]: *** [Makefile:765: test-suite.log] Error 1
gmake[3]: Leaving directory '/usr<https://ci.centos.org/job/libvirt-dbus-master-check/systems=libvirt-freebsd-10/ws/build/tests'>
gmake[2]: *** [Makefile:873: check-TESTS] Error 2
gmake[2]: Leaving directory '/usr<https://ci.centos.org/job/libvirt-dbus-master-check/systems=libvirt-freebsd-10/ws/build/tests'>
gmake[1]: *** [Makefile:989: check-am] Error 2
gmake[1]: Leaving directory '/usr<https://ci.centos.org/job/libvirt-dbus-master-check/systems=libvirt-freebsd-10/ws/build/tests'>
gmake: *** [Makefile:459: check-recursive] Error 1
+ cat tests/test-suite.log
==============================================
   libvirt-dbus 1.3.0: tests/test-suite.log
==============================================

# TOTAL: 7
# PASS:  6
# SKIP:  0
# XFAIL: 0
# FAIL:  1
# XPASS: 0
# ERROR: 0

.. contents:: :depth: 2

FAIL: test_interface.py
=======================

../../build-aux/test-driver: ../../tests/test_interface.py: not found
FAIL test_interface.py (exit status: 127)

+ exit 1
Build step 'Execute shell' marked build as failure


[Date Prev][Date Next]   [Thread Prev][Thread Next]   [Thread Index] [Date Index] [Author Index]