[Date Prev][Date Next]   [Thread Prev][Thread Next]   [Thread Index] [Date Index] [Author Index]

[Libvirt-ci] Build failed in Jenkins: libvirt-master- check » libvirt-freebsd-10 #1155



See <https://ci.centos.org/job/libvirt-master-check/systems=libvirt-freebsd-10/1155/display/redirect>

------------------------------------------
[...truncated 49.61 KB...]
SKIP: virnettlssessiontest
PASS: fdstreamtest
PASS: virdbustest
SKIP: virsystemdtest
PASS: virpolkittest
PASS: qemuxml2argvtest
PASS: qemuxml2xmltest
PASS: qemuargv2xmltest
PASS: domainsnapshotxml2xmltest
PASS: qemumonitorjsontest
PASS: virschematest
PASS: qemuagenttest
PASS: qemuhotplugtest
PASS: qemucaps2xmltest
PASS: qemumemlocktest
PASS: qemucommandutiltest
PASS: qemucapabilitiestest
PASS: qemumigparamstest
PASS: esxutilstest
PASS: qemublocktest
PASS: vboxsnapshotxmltest
PASS: vmx2xmltest
PASS: vmwarevertest
PASS: xml2vmxtest
PASS: bhyvexml2xmltest
FAIL: bhyvexml2argvtest
PASS: virjsontest
PASS: networkxml2xmltest
PASS: bhyveargv2xmltest
PASS: networkxml2conftest
PASS: networkxml2xmlupdatetest
SKIP: networkxml2firewalltest
PASS: storagevolxml2argvtest
PASS: virstorageutiltest
PASS: nsstest
PASS: nwfilterxml2xmltest
PASS: nssguesttest
PASS: storagevolxml2xmltest
PASS: nodedevxml2xmltest
PASS: storagepoolxml2xmltest
PASS: interfacexml2xmltest
PASS: metadatatest
PASS: secretxml2xmltest
PASS: genericxml2xmltest
PASS: eventtest
PASS: virdrivermoduletest
PASS: objecteventtest
PASS: virmacmaptest
PASS: libvirtd-fail
PASS: libvirtd-pool
PASS: virsh-cpuset
PASS: virsh-define-dev-segfault
PASS: virsh-int-overflow
SKIP: virsh-optparse
PASS: virsh-read-bufsiz
PASS: virsh-read-non-seekable
PASS: virsh-schedinfo
PASS: virsh-self-test
PASS: cputest
PASS: virt-admin-self-test
PASS: virsh-start
PASS: virsh-undefine
PASS: virsh-uriprecedence
PASS: virsh-vcpupin
PASS: virshtest
============================================================================
Testsuite summary for libvirt 4.5.0
============================================================================
# TOTAL: 108
# PASS:  93
# SKIP:  14
# XFAIL: 0
# FAIL:  1
# XPASS: 0
# ERROR: 0
============================================================================
See tests/test-suite.log
Please report to libvir-list redhat com
============================================================================
gmake[3]: *** [Makefile:5674: test-suite.log] Error 1
gmake[3]: Leaving directory '/usr<https://ci.centos.org/job/libvirt-master-check/systems=libvirt-freebsd-10/ws/build/tests'>
gmake[2]: *** [Makefile:5782: check-TESTS] Error 2
gmake[2]: Leaving directory '/usr<https://ci.centos.org/job/libvirt-master-check/systems=libvirt-freebsd-10/ws/build/tests'>
gmake[1]: *** [Makefile:6770: check-am] Error 2
gmake[1]: Leaving directory '/usr<https://ci.centos.org/job/libvirt-master-check/systems=libvirt-freebsd-10/ws/build/tests'>
gmake: *** [Makefile:2104: check-recursive] Error 1
+ cat tests/test-suite.log
=========================================
   libvirt 4.5.0: tests/test-suite.log
=========================================

# TOTAL: 108
# PASS:  93
# SKIP:  14
# XFAIL: 0
# FAIL:  1
# XPASS: 0
# ERROR: 0

.. contents:: :depth: 2

SKIP: virhostcputest
====================

SKIP virhostcputest (exit status: 77)

SKIP: shunloadtest
==================

SKIP shunloadtest (exit status: 77)

SKIP: vircgrouptest
===================

SKIP vircgrouptest (exit status: 77)

SKIP: virpcitest
================

SKIP virpcitest (exit status: 77)

SKIP: virfirewalltest
=====================

SKIP virfirewalltest (exit status: 77)

SKIP: virportallocatortest
==========================

SKIP virportallocatortest (exit status: 77)

SKIP: virkmodtest
=================

SKIP virkmodtest (exit status: 77)

SKIP: virhostdevtest
====================

SKIP virhostdevtest (exit status: 77)

SKIP: virnetdevtest
===================

SKIP virnetdevtest (exit status: 77)

SKIP: virnettlscontexttest
==========================

SKIP virnettlscontexttest (exit status: 77)

SKIP: virnettlssessiontest
==========================

SKIP virnettlssessiontest (exit status: 77)

SKIP: virsystemdtest
====================

SKIP virsystemdtest (exit status: 77)

FAIL: bhyvexml2argvtest
=======================

TEST: bhyvexml2argvtest
 1) BHYVE XML-2-ARGV base                                             ... OK
 2) BHYVE XML-2-ARGV wired                                            ... OK
 3) BHYVE XML-2-ARGV acpiapic                                         ... OK
 4) BHYVE XML-2-ARGV disk-cdrom                                       ... OK
 5) BHYVE XML-2-ARGV disk-virtio                                      ... OK
 6) BHYVE XML-2-ARGV macaddr                                          ... OK
 7) BHYVE XML-2-ARGV serial                                           ... OK
 8) BHYVE XML-2-ARGV console                                          ... OK
 9) BHYVE XML-2-ARGV grub-defaults                                    ... OK
10) BHYVE XML-2-ARGV grub-bootorder                                   ... OK
11) BHYVE XML-2-ARGV grub-bootorder2                                  ... OK
12) BHYVE XML-2-ARGV bhyveload-bootorder                              ... OK
13) BHYVE XML-2-ARGV bhyveload-bootorder1                             ... OK
14) BHYVE XML-2-ARGV bhyveload-bootorder2                             ... Got expected error: unsupported configuration: Cannot find boot device of requested type cdrom
OK
15) BHYVE XML-2-ARGV bhyveload-bootorder3                             ... OK
16) BHYVE XML-2-ARGV bhyveload-explicitargs                           ... OK
17) BHYVE XML-2-ARGV bhyveload-bootorder4                             ... Got expected error: unsupported configuration: Only one boot device is supported
OK
18) BHYVE XML-2-ARGV bhyveload-bootorder5                             ... libvirt: Domain Config error : unsupported configuration: per-device boot elements cannot be used together with os/boot elements
OK
19) BHYVE XML-2-ARGV custom-loader                                    ... OK
20) BHYVE XML-2-ARGV disk-cdrom-grub                                  ... OK
21) BHYVE XML-2-ARGV serial-grub                                      ... OK
22) BHYVE XML-2-ARGV localtime                                        ... OK
23) BHYVE XML-2-ARGV net-e1000                                        ... OK
24) BHYVE XML-2-ARGV uefi                                             ... OK
25) BHYVE XML-2-ARGV vnc                                              ... OK
26) BHYVE XML-2-ARGV vnc-vgaconf-on                                   ... OK
27) BHYVE XML-2-ARGV vnc-vgaconf-off                                  ... OK
28) BHYVE XML-2-ARGV vnc-vgaconf-io                                   ... libvirt: Domain Config error : unsupported configuration: unknown vgaconf value 'io'
OK
29) BHYVE XML-2-ARGV vnc-autoport                                     ... OK
30) BHYVE XML-2-ARGV cputopology                                      ... I/O warning : failed to load external entity "/usr<https://ci.centos.org/job/libvirt-master-check/systems=libvirt-freebsd-10/ws/tests/bhyvexml2argvdata/bhyvexml2argv-cputopology.xml";>
libvirt: Domain Config error : XML error: failed to parse xml document
FAILED
31) BHYVE XML-2-ARGV cputopology-nvcpu-mismatch                       ... I/O warning : failed to load external entity "/usr<https://ci.centos.org/job/libvirt-master-check/systems=libvirt-freebsd-10/ws/tests/bhyvexml2argvdata/bhyvexml2argv-cputopology-nvcpu-mismatch.xml";>
Got expected error: XML error: failed to parse xml document
OK
32) BHYVE XML-2-ARGV addr-single-sata-disk                            ... OK
33) BHYVE XML-2-ARGV addr-multiple-sata-disks                         ... OK
34) BHYVE XML-2-ARGV addr-more-than-32-sata-disks                     ... OK
35) BHYVE XML-2-ARGV addr-single-virtio-disk                          ... OK
36) BHYVE XML-2-ARGV addr-multiple-virtio-disks                       ... OK
37) BHYVE XML-2-ARGV addr-no32devs-single-sata-disk                   ... OK
38) BHYVE XML-2-ARGV addr-no32devs-multiple-sata-disks                ... OK
39) BHYVE XML-2-ARGV addr-no32devs-more-than-32-sata-disks            ... Got expected error: internal error: No more available PCI slots
OK
40) BHYVE XML-2-ARGV input-xhci-tablet                                ... OK
41) BHYVE XML-2-ARGV xhci-multiple-controllers                        ... Got expected error: unsupported configuration: only single USB controller is supported
OK
42) BHYVE XML-2-ARGV xhci-no-devs                                     ... Got expected error: unsupported configuration: only single input device is supported
OK
43) BHYVE XML-2-ARGV xhci-multiple-devs                               ... Got expected error: unsupported configuration: only single input device is supported
OK
44) BHYVE XML-2-ARGV input-xhci-tablet                                ... OK
45) BHYVE XML-2-ARGV serial-grub-nocons                               ... OK
46) BHYVE XML-2-ARGV net-e1000                                        ... Got expected error: unsupported configuration: NIC model 'e1000' is not supported by given bhyve binary
OK
47) BHYVE XML-2-ARGV uefi                                             ... Got expected error: unsupported configuration: Installed bhyve binary does not support UEFI loader
OK
48) BHYVE XML-2-ARGV vnc                                              ... Got expected error: unsupported configuration: Installed bhyve binary does not support UEFI loader
OK
49) BHYVE XML-2-ARGV cputopology                                      ... I/O warning : failed to load external entity "/usr<https://ci.centos.org/job/libvirt-master-check/systems=libvirt-freebsd-10/ws/tests/bhyvexml2argvdata/bhyvexml2argv-cputopology.xml";>
Got expected error: XML error: failed to parse xml document
OK
FAIL bhyvexml2argvtest (exit status: 1)

SKIP: networkxml2firewalltest
=============================

SKIP networkxml2firewalltest (exit status: 77)

SKIP: virsh-optparse
====================

../../tests/virsh-optparse: skipping test: 
This test is very expensive, so it is disabled by default.
To run it anyway, rerun: make check VIR_TEST_EXPENSIVE=1

SKIP virsh-optparse (exit status: 77)

+ exit 1
Build step 'Execute shell' marked build as failure


[Date Prev][Date Next]   [Thread Prev][Thread Next]   [Thread Index] [Date Index] [Author Index]