[Date Prev][Date Next]   [Thread Prev][Thread Next]   [Thread Index] [Date Index] [Author Index]

[Libvirt-ci] Build failed in Jenkins: libvirt-dbus-ma ster-check » libvirt-fedora-27 #188



See <https://ci.centos.org/job/libvirt-dbus-master-check/systems=libvirt-fedora-27/188/display/redirect>

------------------------------------------
Started by upstream project "libvirt-dbus-master-check" build number 188
originally caused by:
 Started by upstream project "libvirt-dbus-master-build" build number 221
 originally caused by:
  Started by upstream project "libvirt-glib-master-build" build number 1198
  originally caused by:
   Started by upstream project "libvirt-master-build" build number 1525
   originally caused by:
    Started by an SCM change
[EnvInject] - Loading node environment variables.
Building remotely on libvirt-fedora-27 (libvirt) in workspace <https://ci.centos.org/job/libvirt-dbus-master-check/systems=libvirt-fedora-27/ws/>
[libvirt-dbus-master] $ /bin/sh -xe /tmp/jenkins872576748058967156.sh
+ cd build
+ /usr/bin/gmake check
Making check in data
gmake[1]: Entering directory '<https://ci.centos.org/job/libvirt-dbus-master-check/systems=libvirt-fedora-27/ws/build/data'>
gmake[1]: Nothing to be done for 'check'.
gmake[1]: Leaving directory '<https://ci.centos.org/job/libvirt-dbus-master-check/systems=libvirt-fedora-27/ws/build/data'>
Making check in docs
gmake[1]: Entering directory '<https://ci.centos.org/job/libvirt-dbus-master-check/systems=libvirt-fedora-27/ws/build/docs'>
gmake[1]: Nothing to be done for 'check'.
gmake[1]: Leaving directory '<https://ci.centos.org/job/libvirt-dbus-master-check/systems=libvirt-fedora-27/ws/build/docs'>
Making check in src
gmake[1]: Entering directory '<https://ci.centos.org/job/libvirt-dbus-master-check/systems=libvirt-fedora-27/ws/build/src'>
gmake[1]: Nothing to be done for 'check'.
gmake[1]: Leaving directory '<https://ci.centos.org/job/libvirt-dbus-master-check/systems=libvirt-fedora-27/ws/build/src'>
Making check in tests
gmake[1]: Entering directory '<https://ci.centos.org/job/libvirt-dbus-master-check/systems=libvirt-fedora-27/ws/build/tests'>
/usr/bin/gmake  test_util
gmake[2]: Entering directory '<https://ci.centos.org/job/libvirt-dbus-master-check/systems=libvirt-fedora-27/ws/build/tests'>
  CC       test_util-test_util.o
  CC       test_util-util.o
../../tests/test_util.c: In function ‘main’:
../../tests/test_util.c:38:16: error: ‘EXIT_FAILURE’ undeclared (first use in this function); did you mean ‘G_IS_FILE’?
         return EXIT_FAILURE; \
                ^
../../tests/test_util.c:42:5: note: in expansion of macro ‘TEST_ENCODE_DECODE’
     TEST_ENCODE_DECODE("foobar", "foobar");
     ^~~~~~~~~~~~~~~~~~
../../tests/test_util.c:38:16: note: each undeclared identifier is reported only once for each function it appears in
         return EXIT_FAILURE; \
                ^
../../tests/test_util.c:42:5: note: in expansion of macro ‘TEST_ENCODE_DECODE’
     TEST_ENCODE_DECODE("foobar", "foobar");
     ^~~~~~~~~~~~~~~~~~
../../tests/test_util.c:46:12: error: ‘EXIT_SUCCESS’ undeclared (first use in this function)
     return EXIT_SUCCESS;
            ^~~~~~~~~~~~
gmake[2]: *** [Makefile:611: test_util-test_util.o] Error 1
gmake[2]: Leaving directory '<https://ci.centos.org/job/libvirt-dbus-master-check/systems=libvirt-fedora-27/ws/build/tests'>
gmake[1]: *** [Makefile:912: check-am] Error 2
gmake[1]: Leaving directory '<https://ci.centos.org/job/libvirt-dbus-master-check/systems=libvirt-fedora-27/ws/build/tests'>
gmake: *** [Makefile:417: check-recursive] Error 1
+ cat tests/test-suite.log
cat: tests/test-suite.log: No such file or directory
+ true
+ exit 1
Build step 'Execute shell' marked build as failure


[Date Prev][Date Next]   [Thread Prev][Thread Next]   [Thread Index] [Date Index] [Author Index]