[Date Prev][Date Next]   [Thread Prev][Thread Next]   [Thread Index] [Date Index] [Author Index]

[Libvirt-ci] Build failed in Jenkins: libvirt-dbus-ch eck » libvirt-fedora-rawhide #468



See <https://ci.centos.org/job/libvirt-dbus-check/systems=libvirt-fedora-rawhide/468/display/redirect>

------------------------------------------
[...truncated 13.03 KB...]
        if is_py2:
            get_args_opts['utf8_strings'] = kwargs.get('utf8_strings', False)
        elif 'utf8_strings' in kwargs:
            raise TypeError("unexpected keyword argument 'utf8_strings'")
    
        message = MethodCallMessage(destination=bus_name,
                                    path=object_path,
                                    interface=dbus_interface,
                                    method=method)
        # Add the arguments to the function
        try:
            message.append(signature=signature, *args)
        except Exception as e:
            logging.basicConfig()
            _logger.error('Unable to set arguments %r according to '
                          'signature %r: %s: %s',
                          args, signature, e.__class__, e)
            raise
    
        # make a blocking call
        reply_message = self.send_message_with_reply_and_block(
>           message, timeout)
E       dbus.exceptions.DBusException: org.libvirt.Error: internal error: domain 'test' not running

/usr/lib64/python3.7/site-packages/dbus/connection.py:651: DBusException
--------------------------- Captured stderr teardown ---------------------------
Disconnected from D-Bus.
___________________________ TestDomain.test_suspend ____________________________

self = <test_domain.TestDomain object at 0x7f0c9d73f050>

    def test_suspend(self):
        def domain_suspended(path, event, detail):
            if event != libvirttest.DomainEvent.SUSPENDED:
                return
            assert detail == libvirttest.DomainEventSuspendedDetailType.PAUSED
            assert isinstance(path, dbus.ObjectPath)
            self.loop.quit()
    
        self.connect.connect_to_signal('DomainEvent', domain_suspended)
    
        obj, domain = self.get_test_domain()
>       domain.Suspend()

../../tests/test_domain.py:125: 
_ _ _ _ _ _ _ _ _ _ _ _ _ _ _ _ _ _ _ _ _ _ _ _ _ _ _ _ _ _ _ _ _ _ _ _ _ _ _ _ 
/usr/lib64/python3.7/site-packages/dbus/proxies.py:70: in __call__
    return self._proxy_method(*args, **keywords)
/usr/lib64/python3.7/site-packages/dbus/proxies.py:145: in __call__
    **keywords)
_ _ _ _ _ _ _ _ _ _ _ _ _ _ _ _ _ _ _ _ _ _ _ _ _ _ _ _ _ _ _ _ _ _ _ _ _ _ _ _ 

self = <dbus._dbus.SessionBus (session) at 0x7f0c9d6d2b90>
bus_name = dbus.String(':1.2')
object_path = dbus.ObjectPath('/org/libvirt/Test/domain/_6695eb01_f6a4_8304_79aa_97f2502e193f')
dbus_interface = 'org.libvirt.Domain', method = 'Suspend', signature = ''
args = (), timeout = -1.0, byte_arrays = False, kwargs = {}
get_args_opts = {'byte_arrays': False}
message = <dbus.lowlevel.MethodCallMessage path: /org/libvirt/Test/domain/_6695eb01_f6a4_8304_79aa_97f2502e193f, iface: org.libvirt.Domain, member: Suspend dest: :1.2>

    def call_blocking(self, bus_name, object_path, dbus_interface, method,
                      signature, args, timeout=-1.0,
                      byte_arrays=False, **kwargs):
        """Call the given method, synchronously.
        :Since: 0.81.0
        """
        if object_path == LOCAL_PATH:
            raise DBusException('Methods may not be called on the reserved '
                                'path %s' % LOCAL_PATH)
        if dbus_interface == LOCAL_IFACE:
            raise DBusException('Methods may not be called on the reserved '
                                'interface %s' % LOCAL_IFACE)
        # no need to validate other args - MethodCallMessage ctor will do
    
        get_args_opts = dict(byte_arrays=byte_arrays)
        if is_py2:
            get_args_opts['utf8_strings'] = kwargs.get('utf8_strings', False)
        elif 'utf8_strings' in kwargs:
            raise TypeError("unexpected keyword argument 'utf8_strings'")
    
        message = MethodCallMessage(destination=bus_name,
                                    path=object_path,
                                    interface=dbus_interface,
                                    method=method)
        # Add the arguments to the function
        try:
            message.append(signature=signature, *args)
        except Exception as e:
            logging.basicConfig()
            _logger.error('Unable to set arguments %r according to '
                          'signature %r: %s: %s',
                          args, signature, e.__class__, e)
            raise
    
        # make a blocking call
        reply_message = self.send_message_with_reply_and_block(
>           message, timeout)
E       dbus.exceptions.DBusException: org.libvirt.Error: internal error: domain 'test' not running

/usr/lib64/python3.7/site-packages/dbus/connection.py:651: DBusException
--------------------------- Captured stderr teardown ---------------------------
Disconnected from D-Bus.
___________________________ TestDomain.test_undefine ___________________________

self = <test_domain.TestDomain object at 0x7f0c9d755f90>

    def test_undefine(self):
        def domain_undefined(path, event, detail):
            if event != libvirttest.DomainEvent.UNDEFINED:
                return
            assert detail == libvirttest.DomainEventUndefinedDetailType.REMOVED
            assert isinstance(path, dbus.ObjectPath)
            self.loop.quit()
    
        self.connect.connect_to_signal('DomainEvent', domain_undefined)
    
        _, domain = self.get_test_domain()
>       domain.Shutdown(0)

../../tests/test_domain.py:143: 
_ _ _ _ _ _ _ _ _ _ _ _ _ _ _ _ _ _ _ _ _ _ _ _ _ _ _ _ _ _ _ _ _ _ _ _ _ _ _ _ 
/usr/lib64/python3.7/site-packages/dbus/proxies.py:70: in __call__
    return self._proxy_method(*args, **keywords)
/usr/lib64/python3.7/site-packages/dbus/proxies.py:145: in __call__
    **keywords)
_ _ _ _ _ _ _ _ _ _ _ _ _ _ _ _ _ _ _ _ _ _ _ _ _ _ _ _ _ _ _ _ _ _ _ _ _ _ _ _ 

self = <dbus._dbus.SessionBus (session) at 0x7f0c9d6d2b90>
bus_name = dbus.String(':1.2')
object_path = dbus.ObjectPath('/org/libvirt/Test/domain/_6695eb01_f6a4_8304_79aa_97f2502e193f')
dbus_interface = 'org.libvirt.Domain', method = 'Shutdown', signature = 'u'
args = (0,), timeout = -1.0, byte_arrays = False, kwargs = {}
get_args_opts = {'byte_arrays': False}
message = <dbus.lowlevel.MethodCallMessage path: /org/libvirt/Test/domain/_6695eb01_f6a4_8304_79aa_97f2502e193f, iface: org.libvirt.Domain, member: Shutdown dest: :1.2>

    def call_blocking(self, bus_name, object_path, dbus_interface, method,
                      signature, args, timeout=-1.0,
                      byte_arrays=False, **kwargs):
        """Call the given method, synchronously.
        :Since: 0.81.0
        """
        if object_path == LOCAL_PATH:
            raise DBusException('Methods may not be called on the reserved '
                                'path %s' % LOCAL_PATH)
        if dbus_interface == LOCAL_IFACE:
            raise DBusException('Methods may not be called on the reserved '
                                'interface %s' % LOCAL_IFACE)
        # no need to validate other args - MethodCallMessage ctor will do
    
        get_args_opts = dict(byte_arrays=byte_arrays)
        if is_py2:
            get_args_opts['utf8_strings'] = kwargs.get('utf8_strings', False)
        elif 'utf8_strings' in kwargs:
            raise TypeError("unexpected keyword argument 'utf8_strings'")
    
        message = MethodCallMessage(destination=bus_name,
                                    path=object_path,
                                    interface=dbus_interface,
                                    method=method)
        # Add the arguments to the function
        try:
            message.append(signature=signature, *args)
        except Exception as e:
            logging.basicConfig()
            _logger.error('Unable to set arguments %r according to '
                          'signature %r: %s: %s',
                          args, signature, e.__class__, e)
            raise
    
        # make a blocking call
        reply_message = self.send_message_with_reply_and_block(
>           message, timeout)
E       dbus.exceptions.DBusException: org.libvirt.Error: internal error: domain 'test' not running

/usr/lib64/python3.7/site-packages/dbus/connection.py:651: DBusException
================= 4 failed, 5 passed, 1 error in 9.92 seconds ==================
FAIL test_domain.py (exit status: 1)

FAIL: test_network.py
=====================

============================= test session starts ==============================
platform linux -- Python 3.7.4rc2, pytest-4.4.1, py-1.8.0, pluggy-0.11.0
rootdir: <https://ci.centos.org/job/libvirt-dbus-check/systems=libvirt-fedora-rawhide/ws/>
collected 7 items

../../tests/test_network.py .E....F                                      [100%]

==================================== ERRORS ====================================
_____________ ERROR at setup of TestNetwork.test_network_autostart _____________

self = <test_network.TestNetwork object at 0x7f395612c9d0>
request = <SubRequest 'libvirt_dbus_setup' for <Function test_network_autostart>>

    @pytest.fixture(autouse=True)
    def libvirt_dbus_setup(self, request):
        """Start libvirt-dbus for each test function
        """
        os.environ['LIBVIRT_DEBUG'] = '3'
        self.libvirt_dbus = subprocess.Popen([exe, '--session'])
        self.bus = dbus.SessionBus()
    
        for i in range(10):
            if self.bus.name_has_owner('org.libvirt'):
                break
            time.sleep(0.1)
        else:
>           raise TimeoutError('error starting libvirt-dbus')
E           TimeoutError: error starting libvirt-dbus

../../tests/libvirttest.py:44: TimeoutError
=================================== FAILURES ===================================
_ TestNetwork.test_network_update[4-4-0-\n    <host mac='00:16:3e:77:e2:ed' name='foo.example.com' ip='192.168.122.10'/>\n    -0] _

self = <test_network.TestNetwork object at 0x7f395612d2d0>, command = '4'
section = '4', parentIndex = 0
xml_str = "\n    <host mac='00:16:3e:77:e2:ed' name='foo.example.com' ip='192.168.122.10'/>\n    "
flags = 0

    @pytest.mark.parametrize("command, section, parentIndex, xml_str, flags", [
        ('4', '4', 0, ip_dhcp_host_xml, 0),  # add-first, ip-dhcp-host
    ])
    def test_network_update(self, command, section, parentIndex, xml_str, flags):
>       _, test_network = self.get_test_network()

../../tests/test_network.py:91: 
_ _ _ _ _ _ _ _ _ _ _ _ _ _ _ _ _ _ _ _ _ _ _ _ _ _ _ _ _ _ _ _ _ _ _ _ _ _ _ _ 

self = <test_network.TestNetwork object at 0x7f395612d2d0>

    def get_test_network(self):
        """Fetch information for the test network from test driver
    
        Returns:
            (dbus.proxies.ProxyObject, dbus.proxies.ProxyObject):
            Test Network Object, Local proxy for the test Network Object.
    
        """
>       path = self.connect.ListNetworks(0)[0]
E       IndexError: list index out of range

../../tests/libvirttest.py:141: IndexError
--------------------------- Captured stderr teardown ---------------------------
Disconnected from D-Bus.
================= 1 failed, 5 passed, 1 error in 5.08 seconds ==================
FAIL test_network.py (exit status: 1)

+ exit 1
Build step 'Execute shell' marked build as failure


[Date Prev][Date Next]   [Thread Prev][Thread Next]   [Thread Index] [Date Index] [Author Index]