[Date Prev][Date Next]   [Thread Prev][Thread Next]   [Thread Index] [Date Index] [Author Index]

[Libvirt-ci] Build failed in Jenkins: libvirt-check » libvirt-fedora-rawhide #515



See <https://ci.centos.org/job/libvirt-check/systems=libvirt-fedora-rawhide/515/display/redirect>

------------------------------------------
[...truncated 25.98 KB...]
PASS: test-time
SKIP: test-ttyname_r
PASS: test-uname
PASS: test-unistd
PASS: test-uc_width
PASS: test-unlockpt
PASS: test-init.sh
PASS: test-unsetenv
PASS: uniwidth/test-uc_width2.sh
PASS: test-vasnprintf
PASS: test-vasprintf
SKIP: test-vc-list-files-cvs.sh
PASS: test-verify
PASS: test-vc-list-files-git.sh
PASS: test-vsnprintf
PASS: test-usleep
PASS: test-wcrtomb.sh
PASS: test-wchar
SKIP: test-wcrtomb-w32-1.sh
SKIP: test-wcrtomb-w32-2.sh
SKIP: test-wcrtomb-w32-3.sh
SKIP: test-wcrtomb-w32-4.sh
SKIP: test-wcrtomb-w32-5.sh
PASS: test-wctype-h
PASS: test-wcwidth
PASS: test-write
PASS: test-xalloc-die.sh
PASS: test-verify.sh
============================================================================
Testsuite summary for libvirt 5.6.0
============================================================================
# TOTAL: 221
# PASS:  195
# SKIP:  26
# XFAIL: 0
# FAIL:  0
# XPASS: 0
# ERROR: 0
============================================================================
gmake[5]: Leaving directory '<https://ci.centos.org/job/libvirt-check/systems=libvirt-fedora-rawhide/ws/build/gnulib/tests'>
gmake[4]: Leaving directory '<https://ci.centos.org/job/libvirt-check/systems=libvirt-fedora-rawhide/ws/build/gnulib/tests'>
gmake[3]: Leaving directory '<https://ci.centos.org/job/libvirt-check/systems=libvirt-fedora-rawhide/ws/build/gnulib/tests'>
gmake[2]: Leaving directory '<https://ci.centos.org/job/libvirt-check/systems=libvirt-fedora-rawhide/ws/build/gnulib/tests'>
gmake[1]: Leaving directory '<https://ci.centos.org/job/libvirt-check/systems=libvirt-fedora-rawhide/ws/build/gnulib/tests'>
Making check in tests
gmake[1]: Entering directory '<https://ci.centos.org/job/libvirt-check/systems=libvirt-fedora-rawhide/ws/build/tests'>
/usr/bin/gmake   
gmake[2]: Entering directory '<https://ci.centos.org/job/libvirt-check/systems=libvirt-fedora-rawhide/ws/build/tests'>
gmake[2]: Nothing to be done for 'all'.
gmake[2]: Leaving directory '<https://ci.centos.org/job/libvirt-check/systems=libvirt-fedora-rawhide/ws/build/tests'>
/usr/bin/gmake  check-TESTS
gmake[2]: Entering directory '<https://ci.centos.org/job/libvirt-check/systems=libvirt-fedora-rawhide/ws/build/tests'>
gmake[3]: Entering directory '<https://ci.centos.org/job/libvirt-check/systems=libvirt-fedora-rawhide/ws/build/tests'>
PASS: sockettest
PASS: virhostcputest
PASS: virbuftest
PASS: seclabeltest
PASS: virhashtest
PASS: virconftest
PASS: viratomictest
PASS: utiltest
PASS: shunloadtest
PASS: virtimetest
PASS: viruritest
PASS: virkeyfiletest
PASS: viralloctest
PASS: virauthconfigtest
PASS: virbitmaptest
PASS: vircgrouptest
PASS: vircryptotest
PASS: virpcitest
PASS: virendiantest
PASS: virfiletest
PASS: virfilecachetest
PASS: virfirewalltest
PASS: viriscsitest
../../build-aux/test-driver: line 107: 28594 Alarm clock             "$@" > $log_file 2>&1
FAIL: commandtest
PASS: virkeycodetest
PASS: virlockspacetest
PASS: virlogtest
PASS: virrotatingfiletest
PASS: virstringtest
PASS: virportallocatortest
PASS: sysinfotest
PASS: virschematest
PASS: vircapstest
PASS: virkmodtest
PASS: domaincapstest
PASS: domainconftest
PASS: virnetdevtest
PASS: virhostdevtest
PASS: virtypedparamtest
PASS: vshtabletest
PASS: virerrortest
PASS: virnetmessagetest
PASS: virnetdaemontest
PASS: virnetserverclienttest
PASS: virnettlscontexttest
PASS: virnettlssessiontest
PASS: virnetsockettest
PASS: fchosttest
PASS: scsihosttest
PASS: vircaps2xmltest
PASS: virresctrltest
PASS: virdbustest
PASS: fdstreamtest
PASS: virsystemdtest
PASS: virpolkittest
PASS: securityselinuxtest
PASS: viridentitytest
PASS: xlconfigtest
PASS: securityselinuxlabeltest
PASS: xmconfigtest
PASS: qemuxml2argvtest
PASS: qemuxml2xmltest
PASS: libxlxml2domconfigtest
PASS: qemudomainsnapshotxml2xmltest
PASS: qemumonitorjsontest
PASS: qemuhotplugtest
PASS: qemuagenttest
PASS: qemucapabilitiestest
PASS: qemucaps2xmltest
PASS: qemumemlocktest
PASS: qemucommandutiltest
PASS: qemumigparamstest
PASS: qemublocktest
PASS: qemufirmwaretest
PASS: qemusecuritytest
PASS: lxcxml2xmltest
PASS: lxcconf2xmltest
PASS: openvzutilstest
PASS: esxutilstest
PASS: vboxsnapshotxmltest
PASS: vmx2xmltest
PASS: xml2vmxtest
PASS: vmwarevertest
PASS: virjsontest
PASS: networkxml2xmltest
PASS: networkxml2xmlupdatetest
PASS: virnetworkportxml2xmltest
PASS: networkxml2conftest
PASS: networkxml2firewalltest
PASS: storagebackendsheepdogtest
PASS: nwfilterxml2xmltest
PASS: virnwfilterbindingxml2xmltest
PASS: nwfilterebiptablestest
PASS: nwfilterxml2firewalltest
PASS: storagevolxml2argvtest
PASS: storagepoolxml2argvtest
PASS: virstorageutiltest
PASS: storagepoolxml2xmltest
PASS: storagepoolcapstest
PASS: virscsitest
PASS: nsstest
PASS: nssguesttest
PASS: storagevolxml2xmltest
PASS: nodedevxml2xmltest
PASS: interfacexml2xmltest
PASS: cputest
PASS: metadatatest
PASS: secretxml2xmltest
PASS: genericxml2xmltest
PASS: virusbtest
PASS: virnetdevbandwidthtest
PASS: eventtest
PASS: virdrivermoduletest
PASS: objecteventtest
PASS: virstoragetest
PASS: virmacmaptest
PASS: libvirtd-pool
PASS: virsh-cpuset
PASS: libvirtd-fail
PASS: virsh-define-dev-segfault
PASS: virsh-int-overflow
PASS: virsh-read-bufsiz
PASS: virsh-read-non-seekable
PASS: virsh-schedinfo
PASS: virsh-self-test
PASS: virt-admin-self-test
PASS: virsh-snapshot
PASS: virsh-start
PASS: virsh-undefine
PASS: virsh-uriprecedence
PASS: virsh-vcpupin
PASS: virsh-optparse
PASS: virshtest
============================================================================
Testsuite summary for libvirt 5.6.0
============================================================================
# TOTAL: 133
# PASS:  132
# SKIP:  0
# XFAIL: 0
# FAIL:  1
# XPASS: 0
# ERROR: 0
============================================================================
See tests/test-suite.log
Please report to libvir-list redhat com
============================================================================
gmake[3]: *** [Makefile:5994: test-suite.log] Error 1
gmake[3]: Leaving directory '<https://ci.centos.org/job/libvirt-check/systems=libvirt-fedora-rawhide/ws/build/tests'>
gmake[2]: *** [Makefile:6102: check-TESTS] Error 2
gmake[2]: Leaving directory '<https://ci.centos.org/job/libvirt-check/systems=libvirt-fedora-rawhide/ws/build/tests'>
gmake[1]: *** [Makefile:7135: check-am] Error 2
gmake[1]: Leaving directory '<https://ci.centos.org/job/libvirt-check/systems=libvirt-fedora-rawhide/ws/build/tests'>
gmake: *** [Makefile:2127: check-recursive] Error 1
+ cat tests/test-suite.log
=========================================
   libvirt 5.6.0: tests/test-suite.log
=========================================

# TOTAL: 133
# PASS:  132
# SKIP:  0
# XFAIL: 0
# FAIL:  1
# XPASS: 0
# ERROR: 0

.. contents:: :depth: 2

FAIL: commandtest
=================

TEST: commandtest
 1) Command Exec test0 test                                           ... OK
 2) Command Exec test1 test                                           ... OK
 3) Command Exec test2 test                                           ... OK
 4) Command Exec test3 test                                           ... OK
 5) Command Exec test4 test                                           ... OK
 6) Command Exec test5 test                                           ... OK
 7) Command Exec test6 test                                           ... OK
 8) Command Exec test7 test                                           ... OK
 9) Command Exec test8 test                                           ... OK
10) Command Exec test9 test                                           ... OK
11) Command Exec test10 test                                          ... OK
12) Command Exec test11 test                                          ... OK
13) Command Exec test12 test                                          ... OK
14) Command Exec test13 test                                          ... OK
15) Command Exec test14 test                                          ... OK
16) Command Exec test15 test                                          ... OK
17) Command Exec test16 test                                          ... OK
18) Command Exec test17 test                                          ... OK
19) Command Exec test18 test                                          ... FAIL commandtest (exit status: 142)

+ exit 1
Build step 'Execute shell' marked build as failure


[Date Prev][Date Next]   [Thread Prev][Thread Next]   [Thread Index] [Date Index] [Author Index]