[Date Prev][Date Next]   [Thread Prev][Thread Next]   [Thread Index] [Date Index] [Author Index]

[Libvirt-ci] Build failed in Jenkins: libvirt-check » libvirt-debian-9 #520

See <https://ci.centos.org/job/libvirt-check/systems=libvirt-debian-9/520/display/redirect>

[...truncated 27.43 KB...]
# XFAIL: 0
# FAIL:  0
# XPASS: 0
# ERROR: 0
make[5]: Leaving directory '<https://ci.centos.org/job/libvirt-check/systems=libvirt-debian-9/ws/build/gnulib/tests'>
make[4]: Leaving directory '<https://ci.centos.org/job/libvirt-check/systems=libvirt-debian-9/ws/build/gnulib/tests'>
make[3]: Leaving directory '<https://ci.centos.org/job/libvirt-check/systems=libvirt-debian-9/ws/build/gnulib/tests'>
make[2]: Leaving directory '<https://ci.centos.org/job/libvirt-check/systems=libvirt-debian-9/ws/build/gnulib/tests'>
make[1]: Leaving directory '<https://ci.centos.org/job/libvirt-check/systems=libvirt-debian-9/ws/build/gnulib/tests'>
Making check in tests
make[1]: Entering directory '<https://ci.centos.org/job/libvirt-check/systems=libvirt-debian-9/ws/build/tests'>
make[2]: Entering directory '<https://ci.centos.org/job/libvirt-check/systems=libvirt-debian-9/ws/build/tests'>
make[2]: Nothing to be done for 'all'.
make[2]: Leaving directory '<https://ci.centos.org/job/libvirt-check/systems=libvirt-debian-9/ws/build/tests'>
/usr/bin/make  check-TESTS
make[2]: Entering directory '<https://ci.centos.org/job/libvirt-check/systems=libvirt-debian-9/ws/build/tests'>
make[3]: Entering directory '<https://ci.centos.org/job/libvirt-check/systems=libvirt-debian-9/ws/build/tests'>
PASS: virhostcputest
PASS: sockettest
PASS: virbuftest
PASS: seclabeltest
PASS: virhashtest
PASS: virconftest
PASS: commandtest
PASS: utiltest
PASS: shunloadtest
PASS: viratomictest
PASS: virtimetest
PASS: viruritest
PASS: virkeyfiletest
PASS: viralloctest
PASS: virauthconfigtest
PASS: virbitmaptest
PASS: vircgrouptest
PASS: vircryptotest
PASS: virendiantest
PASS: virpcitest
PASS: virfilecachetest
PASS: virfirewalltest
PASS: viriscsitest
PASS: virkeycodetest
PASS: virfiletest
PASS: virlockspacetest
PASS: virlogtest
PASS: virrotatingfiletest
PASS: virstringtest
PASS: virportallocatortest
PASS: sysinfotest
PASS: virkmodtest
PASS: vircapstest
PASS: domaincapstest
PASS: domainconftest
PASS: virhostdevtest
PASS: virnetdevtest
PASS: virtypedparamtest
PASS: vshtabletest
PASS: virerrortest
PASS: virnetmessagetest
PASS: virnetsockettest
PASS: virnetdaemontest
PASS: virnetserverclienttest
PASS: virnettlscontexttest
PASS: virschematest
PASS: fchosttest
PASS: scsihosttest
PASS: vircaps2xmltest
PASS: virresctrltest
PASS: fdstreamtest
PASS: virnettlssessiontest
PASS: virdbustest
FAIL: virsystemdtest
PASS: virpolkittest
PASS: securityselinuxtest
PASS: viridentitytest
PASS: securityselinuxlabeltest
PASS: xmconfigtest
PASS: xlconfigtest
PASS: libxlxml2domconfigtest
PASS: virshtest
PASS: qemudomainsnapshotxml2xmltest
PASS: qemumonitorjsontest
PASS: qemuhotplugtest
PASS: qemuxml2xmltest
PASS: qemuagenttest
PASS: qemucaps2xmltest
PASS: qemumemlocktest
PASS: qemucommandutiltest
PASS: qemublocktest
PASS: qemumigparamstest
PASS: qemuxml2argvtest
PASS: qemucapabilitiestest
PASS: qemufirmwaretest
PASS: lxcxml2xmltest
PASS: lxcconf2xmltest
PASS: openvzutilstest
PASS: esxutilstest
PASS: vboxsnapshotxmltest
PASS: vmx2xmltest
PASS: xml2vmxtest
PASS: vmwarevertest
PASS: virjsontest
PASS: networkxml2xmltest
PASS: networkxml2xmlupdatetest
PASS: virnetworkportxml2xmltest
PASS: networkxml2conftest
PASS: qemusecuritytest
PASS: storagebackendsheepdogtest
PASS: networkxml2firewalltest
PASS: nwfilterxml2xmltest
PASS: nwfilterebiptablestest
PASS: virnwfilterbindingxml2xmltest
PASS: nwfilterxml2firewalltest
PASS: storagevolxml2argvtest
PASS: virstorageutiltest
PASS: storagepoolxml2xmltest
PASS: storagepoolxml2argvtest
PASS: storagepoolcapstest
PASS: virscsitest
PASS: nsstest
PASS: nssguesttest
PASS: storagevolxml2xmltest
PASS: nodedevxml2xmltest
PASS: interfacexml2xmltest
PASS: metadatatest
PASS: secretxml2xmltest
PASS: genericxml2xmltest
PASS: virstoragetest
PASS: virusbtest
PASS: virnetdevbandwidthtest
PASS: virdrivermoduletest
PASS: eventtest
PASS: objecteventtest
PASS: virmacmaptest
PASS: libvirtd-fail
PASS: libvirtd-pool
PASS: virsh-cpuset
PASS: virsh-define-dev-segfault
PASS: virsh-int-overflow
PASS: virsh-read-bufsiz
PASS: cputest
PASS: virsh-schedinfo
PASS: virsh-read-non-seekable
PASS: virt-admin-self-test
PASS: virsh-self-test
PASS: virsh-start
PASS: virsh-undefine
PASS: virsh-snapshot
PASS: virsh-uriprecedence
PASS: virsh-vcpupin
PASS: virsh-optparse
PASS: virt-aa-helper-test
Testsuite summary for libvirt 5.6.0
# TOTAL: 134
# PASS:  133
# SKIP:  0
# XFAIL: 0
# FAIL:  1
# XPASS: 0
# ERROR: 0
See tests/test-suite.log
Please report to libvir-list redhat com
Makefile:5866: recipe for target 'test-suite.log' failed
make[3]: *** [test-suite.log] Error 1
make[3]: Leaving directory '<https://ci.centos.org/job/libvirt-check/systems=libvirt-debian-9/ws/build/tests'>
Makefile:5972: recipe for target 'check-TESTS' failed
make[2]: *** [check-TESTS] Error 2
make[2]: Leaving directory '<https://ci.centos.org/job/libvirt-check/systems=libvirt-debian-9/ws/build/tests'>
Makefile:7004: recipe for target 'check-am' failed
make[1]: *** [check-am] Error 2
make[1]: Leaving directory '<https://ci.centos.org/job/libvirt-check/systems=libvirt-debian-9/ws/build/tests'>
Makefile:2127: recipe for target 'check-recursive' failed
make: *** [check-recursive] Error 1
+ cat tests/test-suite.log
   libvirt 5.6.0: tests/test-suite.log

# TOTAL: 134
# PASS:  133
# SKIP:  0
# XFAIL: 0
# FAIL:  1
# XPASS: 0
# ERROR: 0

.. contents:: :depth: 2

FAIL: virsystemdtest

TEST: virsystemdtest
 1) Test create container                                             ... OK
 2) Test create container again                                       ... OK
 3) Test terminate container                                          ... OK
 4) Test terminate container again                                    ... OK
 5) Test create machine                                               ... OK
 6) Test create machine again                                         ... OK
 7) Test terminate machine                                            ... OK
 8) Test terminate machine again                                      ... OK
 9) Test create no systemd                                            ... OK
10) Test create no systemd again                                      ... OK
11) Test create systemd not running                                   ... OK
12) Test create systemd not running again                             ... OK
13) Test create bad systemd                                           ... libvirt: DBus Utils error : Something went wrong creating the machine
14) Test create bad systemd again                                     ... libvirt: DBus Utils error : Something went wrong creating the machine
15) Test create with network                                          ... OK
16) Test create with network again                                    ... OK
17) Test getting machine name                                         ... OK
18) Test getting machine name again                                   ... OK
19) Test scopename                                                    ... OK
20) Test scopename                                                    ... OK
21) Test scopename                                                    ... OK
22) Test scopename                                                    ... OK
23) Test scopename                                                    ... OK
24) Test scopename                                                    ... OK
25) Test scopename                                                    ... OK
26) Test scopename                                                    ... OK
27) Test scopename                                                    ... OK
28) Test scopename                                                    ... OK
29) Test scopename                                                    ... OK
30) Test scopename                                                    ... OK
31) Test scopename                                                    ... OK
32) Test scopename                                                    ... OK
33) Test canSuspend                                                   ... OK
34) Test canSuspend no systemd                                        ... OK
35) Test systemd canSuspend not running                               ... OK
36) Test canHibernate                                                 ... OK
37) Test canHibernate no systemd                                      ... OK
38) Test systemd canHibernate not running                             ... OK
39) Test canHybridSleep                                               ... OK
40) Test canHybridSleep no systemd                                    ... OK
41) Test systemd canHybridSleep not running                           ... OK
42) Test activation empty                                             ... OK
43) Test activation names                                             ... Got 3 IP sockets but expected only 1 or 2
44) Test activation addrs                                             ... Got 3 IP sockets but expected only 1 or 2
FAIL virsystemdtest (exit status: 1)

+ exit 1
Build step 'Execute shell' marked build as failure

[Date Prev][Date Next]   [Thread Prev][Thread Next]   [Thread Index] [Date Index] [Author Index]