[Date Prev][Date Next]   [Thread Prev][Thread Next]   [Thread Index] [Date Index] [Author Index]

[Libvirt-ci] Build failed in Jenkins: libvirt-check » libvirt-debian-10 #521



See <https://ci.centos.org/job/libvirt-check/systems=libvirt-debian-10/521/display/redirect>

------------------------------------------
[...truncated 28.65 KB...]
Testsuite summary for libvirt 5.6.0
============================================================================
# TOTAL: 221
# PASS:  195
# SKIP:  26
# XFAIL: 0
# FAIL:  0
# XPASS: 0
# ERROR: 0
============================================================================
make[5]: Leaving directory '<https://ci.centos.org/job/libvirt-check/systems=libvirt-debian-10/ws/build/gnulib/tests'>
make[4]: Leaving directory '<https://ci.centos.org/job/libvirt-check/systems=libvirt-debian-10/ws/build/gnulib/tests'>
make[3]: Leaving directory '<https://ci.centos.org/job/libvirt-check/systems=libvirt-debian-10/ws/build/gnulib/tests'>
make[2]: Leaving directory '<https://ci.centos.org/job/libvirt-check/systems=libvirt-debian-10/ws/build/gnulib/tests'>
make[1]: Leaving directory '<https://ci.centos.org/job/libvirt-check/systems=libvirt-debian-10/ws/build/gnulib/tests'>
Making check in tests
make[1]: Entering directory '<https://ci.centos.org/job/libvirt-check/systems=libvirt-debian-10/ws/build/tests'>
/usr/bin/make   
make[2]: Entering directory '<https://ci.centos.org/job/libvirt-check/systems=libvirt-debian-10/ws/build/tests'>
make[2]: Nothing to be done for 'all'.
make[2]: Leaving directory '<https://ci.centos.org/job/libvirt-check/systems=libvirt-debian-10/ws/build/tests'>
/usr/bin/make  check-TESTS
make[2]: Entering directory '<https://ci.centos.org/job/libvirt-check/systems=libvirt-debian-10/ws/build/tests'>
make[3]: Entering directory '<https://ci.centos.org/job/libvirt-check/systems=libvirt-debian-10/ws/build/tests'>
PASS: sockettest
PASS: virhostcputest
PASS: virbuftest
PASS: seclabeltest
PASS: virhashtest
PASS: virconftest
PASS: viratomictest
PASS: utiltest
PASS: shunloadtest
PASS: virtimetest
PASS: viruritest
PASS: virkeyfiletest
PASS: viralloctest
PASS: virauthconfigtest
PASS: virbitmaptest
PASS: vircgrouptest
PASS: vircryptotest
PASS: virpcitest
PASS: virendiantest
PASS: virfiletest
PASS: virfilecachetest
PASS: virfirewalltest
PASS: viriscsitest
PASS: virkeycodetest
PASS: virlockspacetest
PASS: virlogtest
PASS: virrotatingfiletest
PASS: virschematest
PASS: virstringtest
PASS: virportallocatortest
PASS: sysinfotest
PASS: virkmodtest
PASS: vircapstest
PASS: domaincapstest
PASS: domainconftest
PASS: virhostdevtest
PASS: virnetdevtest
PASS: virtypedparamtest
PASS: vshtabletest
PASS: virerrortest
PASS: virnetmessagetest
PASS: commandtest
PASS: virnetdaemontest
PASS: virnetserverclienttest
PASS: virnetsockettest
PASS: virnettlscontexttest
PASS: fchosttest
PASS: scsihosttest
PASS: vircaps2xmltest
PASS: virresctrltest
PASS: fdstreamtest
PASS: virdbustest
FAIL: virsystemdtest
PASS: virpolkittest
PASS: securityselinuxtest
PASS: viridentitytest
PASS: securityselinuxlabeltest
PASS: xlconfigtest
PASS: xmconfigtest
PASS: virnettlssessiontest
PASS: libxlxml2domconfigtest
PASS: qemuxml2argvtest
PASS: qemuxml2xmltest
PASS: qemudomainsnapshotxml2xmltest
PASS: qemuhotplugtest
PASS: qemumonitorjsontest
PASS: qemuagenttest
PASS: qemucaps2xmltest
PASS: qemumemlocktest
PASS: qemucapabilitiestest
PASS: qemucommandutiltest
PASS: qemumigparamstest
PASS: qemublocktest
PASS: qemufirmwaretest
PASS: lxcxml2xmltest
PASS: lxcconf2xmltest
PASS: openvzutilstest
PASS: esxutilstest
PASS: vboxsnapshotxmltest
PASS: vmx2xmltest
PASS: xml2vmxtest
PASS: vmwarevertest
PASS: virjsontest
PASS: networkxml2xmltest
PASS: networkxml2xmlupdatetest
PASS: qemusecuritytest
PASS: virnetworkportxml2xmltest
PASS: networkxml2conftest
PASS: networkxml2firewalltest
PASS: nwfilterxml2xmltest
PASS: virnwfilterbindingxml2xmltest
PASS: nwfilterebiptablestest
PASS: nwfilterxml2firewalltest
PASS: storagevolxml2argvtest
PASS: virstorageutiltest
PASS: storagepoolxml2argvtest
PASS: storagepoolxml2xmltest
PASS: storagepoolcapstest
PASS: virscsitest
PASS: nsstest
PASS: nssguesttest
PASS: storagevolxml2xmltest
PASS: nodedevxml2xmltest
PASS: interfacexml2xmltest
PASS: cputest
PASS: metadatatest
PASS: secretxml2xmltest
PASS: genericxml2xmltest
PASS: virusbtest
PASS: virnetdevbandwidthtest
PASS: eventtest
PASS: virdrivermoduletest
PASS: objecteventtest
PASS: virmacmaptest
PASS: libvirtd-fail
PASS: libvirtd-pool
PASS: virsh-cpuset
PASS: virsh-define-dev-segfault
PASS: virsh-int-overflow
PASS: virstoragetest
PASS: virsh-read-bufsiz
PASS: virsh-read-non-seekable
PASS: virsh-schedinfo
PASS: virsh-self-test
PASS: virt-admin-self-test
PASS: virsh-snapshot
PASS: virsh-start
PASS: virsh-undefine
PASS: virsh-uriprecedence
PASS: virsh-optparse
PASS: virsh-vcpupin
PASS: virt-aa-helper-test
PASS: virshtest
============================================================================
Testsuite summary for libvirt 5.6.0
============================================================================
# TOTAL: 133
# PASS:  132
# SKIP:  0
# XFAIL: 0
# FAIL:  1
# XPASS: 0
# ERROR: 0
============================================================================
See tests/test-suite.log
Please report to libvir-list redhat com
============================================================================
make[3]: *** [Makefile:5994: test-suite.log] Error 1
make[3]: Leaving directory '<https://ci.centos.org/job/libvirt-check/systems=libvirt-debian-10/ws/build/tests'>
make[2]: *** [Makefile:6102: check-TESTS] Error 2
make[2]: Leaving directory '<https://ci.centos.org/job/libvirt-check/systems=libvirt-debian-10/ws/build/tests'>
make[1]: *** [Makefile:7135: check-am] Error 2
make[1]: Leaving directory '<https://ci.centos.org/job/libvirt-check/systems=libvirt-debian-10/ws/build/tests'>
make: *** [Makefile:2127: check-recursive] Error 1
+ cat tests/test-suite.log
=========================================
   libvirt 5.6.0: tests/test-suite.log
=========================================

# TOTAL: 133
# PASS:  132
# SKIP:  0
# XFAIL: 0
# FAIL:  1
# XPASS: 0
# ERROR: 0

.. contents:: :depth: 2

FAIL: virsystemdtest
====================

TEST: virsystemdtest
 1) Test create container                                             ... OK
 2) Test create container again                                       ... OK
 3) Test terminate container                                          ... OK
 4) Test terminate container again                                    ... OK
 5) Test create machine                                               ... OK
 6) Test create machine again                                         ... OK
 7) Test terminate machine                                            ... OK
 8) Test terminate machine again                                      ... OK
 9) Test create no systemd                                            ... OK
10) Test create no systemd again                                      ... OK
11) Test create systemd not running                                   ... OK
12) Test create systemd not running again                             ... OK
13) Test create bad systemd                                           ... libvirt: DBus Utils error : Something went wrong creating the machine
OK
14) Test create bad systemd again                                     ... libvirt: DBus Utils error : Something went wrong creating the machine
OK
15) Test create with network                                          ... OK
16) Test create with network again                                    ... OK
17) Test getting machine name                                         ... OK
18) Test getting machine name again                                   ... OK
19) Test scopename                                                    ... OK
20) Test scopename                                                    ... OK
21) Test scopename                                                    ... OK
22) Test scopename                                                    ... OK
23) Test scopename                                                    ... OK
24) Test scopename                                                    ... OK
25) Test scopename                                                    ... OK
26) Test scopename                                                    ... OK
27) Test scopename                                                    ... OK
28) Test scopename                                                    ... OK
29) Test scopename                                                    ... OK
30) Test scopename                                                    ... OK
31) Test scopename                                                    ... OK
32) Test scopename                                                    ... OK
33) Test canSuspend                                                   ... OK
34) Test canSuspend no systemd                                        ... OK
35) Test systemd canSuspend not running                               ... OK
36) Test canHibernate                                                 ... OK
37) Test canHibernate no systemd                                      ... OK
38) Test systemd canHibernate not running                             ... OK
39) Test canHybridSleep                                               ... OK
40) Test canHybridSleep no systemd                                    ... OK
41) Test systemd canHybridSleep not running                           ... OK
42) Test activation empty                                             ... OK
43) Test activation names                                             ... Got 3 IP sockets but expected only 1 or 2
FAILED
44) Test activation addrs                                             ... Got 3 IP sockets but expected only 1 or 2
FAILED
FAIL virsystemdtest (exit status: 1)

+ exit 1
Build step 'Execute shell' marked build as failure


[Date Prev][Date Next]   [Thread Prev][Thread Next]   [Thread Index] [Date Index] [Author Index]