[Date Prev][Date Next]   [Thread Prev][Thread Next]   [Thread Index] [Date Index] [Author Index]

[Libvirt-ci] Build failed in Jenkins: libvirt-check » libvirt-centos-7 #537



See <https://ci.centos.org/job/libvirt-check/systems=libvirt-centos-7/537/display/redirect>

------------------------------------------
[...truncated 26.84 KB...]
PASS: test-sys_ioctl
PASS: test-sys_select
PASS: test-sys_socket
PASS: test-sys_time
PASS: test-sys_stat
PASS: test-sys_types
PASS: test-sys_uio
PASS: test-sys_utsname
PASS: test-sys_wait
PASS: test-termios
PASS: test-thread_self
PASS: test-time
PASS: test-thread_create
SKIP: test-ttyname_r
PASS: test-unistd
PASS: test-uname
PASS: test-uc_width
PASS: test-unlockpt
PASS: test-unsetenv
PASS: test-init.sh
PASS: uniwidth/test-uc_width2.sh
PASS: test-vasnprintf
PASS: test-vasprintf
PASS: test-vc-list-files-git.sh
PASS: test-verify
PASS: test-usleep
SKIP: test-vc-list-files-cvs.sh
PASS: test-vsnprintf
PASS: test-wchar
PASS: test-wcrtomb.sh
SKIP: test-wcrtomb-w32-1.sh
SKIP: test-wcrtomb-w32-2.sh
SKIP: test-wcrtomb-w32-3.sh
SKIP: test-wcrtomb-w32-4.sh
SKIP: test-wcrtomb-w32-5.sh
PASS: test-wctype-h
PASS: test-wcwidth
PASS: test-write
PASS: test-xalloc-die.sh
PASS: test-verify.sh
gmake[6]: Entering directory `<https://ci.centos.org/job/libvirt-check/systems=libvirt-centos-7/ws/build/gnulib/tests'>
/usr/bin/gmake  all-recursive
gmake[7]: Entering directory `<https://ci.centos.org/job/libvirt-check/systems=libvirt-centos-7/ws/build/gnulib/tests'>
Making all in .
gmake[8]: Entering directory `<https://ci.centos.org/job/libvirt-check/systems=libvirt-centos-7/ws/build/gnulib/tests'>
gmake[8]: Nothing to be done for `all-am'.
gmake[8]: Leaving directory `<https://ci.centos.org/job/libvirt-check/systems=libvirt-centos-7/ws/build/gnulib/tests'>
gmake[7]: Leaving directory `<https://ci.centos.org/job/libvirt-check/systems=libvirt-centos-7/ws/build/gnulib/tests'>
gmake[6]: Leaving directory `<https://ci.centos.org/job/libvirt-check/systems=libvirt-centos-7/ws/build/gnulib/tests'>
============================================================================
Testsuite summary for libvirt 5.6.0
============================================================================
# TOTAL: 221
# PASS:  207
# SKIP:  14
# XFAIL: 0
# FAIL:  0
# XPASS: 0
# ERROR: 0
============================================================================
gmake[5]: Leaving directory `<https://ci.centos.org/job/libvirt-check/systems=libvirt-centos-7/ws/build/gnulib/tests'>
gmake[4]: Leaving directory `<https://ci.centos.org/job/libvirt-check/systems=libvirt-centos-7/ws/build/gnulib/tests'>
gmake[3]: Leaving directory `<https://ci.centos.org/job/libvirt-check/systems=libvirt-centos-7/ws/build/gnulib/tests'>
gmake[2]: Leaving directory `<https://ci.centos.org/job/libvirt-check/systems=libvirt-centos-7/ws/build/gnulib/tests'>
gmake[1]: Leaving directory `<https://ci.centos.org/job/libvirt-check/systems=libvirt-centos-7/ws/build/gnulib/tests'>
Making check in tests
gmake[1]: Entering directory `<https://ci.centos.org/job/libvirt-check/systems=libvirt-centos-7/ws/build/tests'>
/usr/bin/gmake   
gmake[2]: Entering directory `<https://ci.centos.org/job/libvirt-check/systems=libvirt-centos-7/ws/build/tests'>
gmake[2]: Nothing to be done for `all'.
gmake[2]: Leaving directory `<https://ci.centos.org/job/libvirt-check/systems=libvirt-centos-7/ws/build/tests'>
/usr/bin/gmake  check-TESTS
gmake[2]: Entering directory `<https://ci.centos.org/job/libvirt-check/systems=libvirt-centos-7/ws/build/tests'>
gmake[3]: Entering directory `<https://ci.centos.org/job/libvirt-check/systems=libvirt-centos-7/ws/build/tests'>
PASS: sockettest
PASS: virhostcputest
PASS: virbuftest
PASS: commandtest
PASS: seclabeltest
PASS: virhashtest
PASS: virconftest
PASS: utiltest
PASS: shunloadtest
PASS: viratomictest
PASS: viruritest
PASS: virtimetest
PASS: virkeyfiletest
PASS: viralloctest
PASS: virauthconfigtest
PASS: virbitmaptest
PASS: vircgrouptest
PASS: vircryptotest
PASS: virpcitest
PASS: virendiantest
PASS: virfilecachetest
PASS: virfiletest
PASS: virfirewalltest
PASS: viriscsitest
PASS: virkeycodetest
PASS: virlockspacetest
PASS: virlogtest
PASS: virrotatingfiletest
PASS: virstringtest
PASS: virportallocatortest
PASS: sysinfotest
PASS: virkmodtest
PASS: virschematest
PASS: vircapstest
PASS: virshtest
PASS: domaincapstest
PASS: virhostdevtest
PASS: domainconftest
PASS: virnetdevtest
PASS: virtypedparamtest
PASS: vshtabletest
PASS: virerrortest
PASS: virnetmessagetest
PASS: virnetsockettest
PASS: virnetdaemontest
PASS: virnetserverclienttest
PASS: fchosttest
PASS: scsihosttest
PASS: vircaps2xmltest
PASS: virnettlscontexttest
PASS: virresctrltest
PASS: virnettlssessiontest
PASS: virdbustest
PASS: fdstreamtest
PASS: virsystemdtest
PASS: viridentitytest
PASS: virpolkittest
PASS: securityselinuxtest
PASS: securityselinuxlabeltest
PASS: qemudomainsnapshotxml2xmltest
PASS: qemuxml2xmltest
PASS: qemumonitorjsontest
PASS: qemuxml2argvtest
PASS: qemuhotplugtest
PASS: qemucaps2xmltest
PASS: qemumemlocktest
PASS: qemucommandutiltest
PASS: qemuagenttest
PASS: qemucapabilitiestest
PASS: qemublocktest
PASS: qemumigparamstest
PASS: qemufirmwaretest
PASS: lxcxml2xmltest
PASS: qemusecuritytest
PASS: lxcconf2xmltest
PASS: openvzutilstest
PASS: esxutilstest
PASS: vboxsnapshotxmltest
PASS: vmx2xmltest
PASS: xml2vmxtest
PASS: vmwarevertest
PASS: virjsontest
PASS: virnetworkportxml2xmltest
PASS: networkxml2xmlupdatetest
PASS: networkxml2xmltest
PASS: networkxml2firewalltest
PASS: networkxml2conftest
PASS: nwfilterebiptablestest
PASS: virnwfilterbindingxml2xmltest
PASS: nwfilterxml2xmltest
PASS: nwfilterxml2firewalltest
PASS: storagevolxml2argvtest
PASS: storagepoolxml2argvtest
PASS: storagepoolxml2xmltest
PASS: virstorageutiltest
PASS: storagepoolcapstest
PASS: virscsitest
PASS: nsstest
PASS: nssguesttest
PASS: storagevolxml2xmltest
PASS: nodedevxml2xmltest
PASS: interfacexml2xmltest
PASS: virstoragetest
PASS: metadatatest
PASS: secretxml2xmltest
PASS: genericxml2xmltest
PASS: virusbtest
PASS: virnetdevbandwidthtest
PASS: eventtest
PASS: virdrivermoduletest
PASS: cputest
PASS: objecteventtest
PASS: virmacmaptest
PASS: virnetdevopenvswitchtest
PASS: libvirtd-pool
PASS: libvirtd-fail
PASS: virsh-cpuset
PASS: virsh-define-dev-segfault
PASS: virsh-int-overflow
PASS: virsh-read-non-seekable
PASS: virsh-read-bufsiz
PASS: virsh-schedinfo
PASS: virsh-self-test
PASS: virt-admin-self-test
PASS: virsh-start
PASS: virsh-snapshot
PASS: virsh-undefine
PASS: virsh-uriprecedence
PASS: virsh-vcpupin
FAIL: virsh-optparse
gmake[4]: Entering directory `<https://ci.centos.org/job/libvirt-check/systems=libvirt-centos-7/ws/build/tests'>
gmake[4]: Nothing to be done for `all'.
gmake[4]: Leaving directory `<https://ci.centos.org/job/libvirt-check/systems=libvirt-centos-7/ws/build/tests'>
============================================================================
Testsuite summary for libvirt 5.6.0
============================================================================
# TOTAL: 130
# PASS:  129
# SKIP:  0
# XFAIL: 0
# FAIL:  1
# XPASS: 0
# ERROR: 0
============================================================================
See tests/test-suite.log
Please report to libvir-list redhat com
============================================================================
gmake[3]: *** [test-suite.log] Error 1
gmake[3]: Leaving directory `<https://ci.centos.org/job/libvirt-check/systems=libvirt-centos-7/ws/build/tests'>
gmake[2]: *** [check-TESTS] Error 2
gmake[2]: Leaving directory `<https://ci.centos.org/job/libvirt-check/systems=libvirt-centos-7/ws/build/tests'>
gmake[1]: *** [check-am] Error 2
gmake[1]: Leaving directory `<https://ci.centos.org/job/libvirt-check/systems=libvirt-centos-7/ws/build/tests'>
gmake: *** [check-recursive] Error 1
+ cat tests/test-suite.log
=========================================
   libvirt 5.6.0: tests/test-suite.log
=========================================

# TOTAL: 130
# PASS:  129
# SKIP:  0
# XFAIL: 0
# FAIL:  1
# XPASS: 0
# ERROR: 0

.. contents:: :depth: 2

FAIL: virsh-optparse
====================


+ exit 1
Build step 'Execute shell' marked build as failure


[Date Prev][Date Next]   [Thread Prev][Thread Next]   [Thread Index] [Date Index] [Author Index]