[Date Prev][Date Next]   [Thread Prev][Thread Next]   [Thread Index] [Date Index] [Author Index]

[Libvirt-ci] Build failed in Jenkins: libvirt-check » libvirt-fedora-30 #537



See <https://ci.centos.org/job/libvirt-check/systems=libvirt-fedora-30/537/display/redirect>

------------------------------------------
[...truncated 25.72 KB...]
PASS: test-strerror_r
PASS: test-string
PASS: test-strings
PASS: test-strnlen
PASS: test-symlink
PASS: test-sys_ioctl
PASS: test-sys_select
PASS: test-sys_socket
PASS: test-sys_stat
PASS: test-sys_time
PASS: test-sleep
PASS: test-sigprocmask
PASS: test-sys_types
PASS: test-sys_utsname
PASS: test-sys_uio
PASS: test-sys_wait
PASS: test-termios
PASS: test-thread_self
PASS: test-thread_create
PASS: test-time
SKIP: test-ttyname_r
PASS: test-uname
PASS: test-unistd
PASS: test-uc_width
PASS: test-unlockpt
PASS: test-unsetenv
PASS: test-init.sh
PASS: uniwidth/test-uc_width2.sh
PASS: test-vasnprintf
PASS: test-vasprintf
SKIP: test-vc-list-files-cvs.sh
PASS: test-verify
PASS: test-vc-list-files-git.sh
PASS: test-vsnprintf
PASS: test-usleep
PASS: test-wchar
PASS: test-wcrtomb.sh
SKIP: test-wcrtomb-w32-1.sh
SKIP: test-wcrtomb-w32-3.sh
SKIP: test-wcrtomb-w32-2.sh
SKIP: test-wcrtomb-w32-4.sh
SKIP: test-wcrtomb-w32-5.sh
PASS: test-wcwidth
PASS: test-wctype-h
PASS: test-write
PASS: test-xalloc-die.sh
PASS: test-verify.sh
============================================================================
Testsuite summary for libvirt 5.6.0
============================================================================
# TOTAL: 221
# PASS:  195
# SKIP:  26
# XFAIL: 0
# FAIL:  0
# XPASS: 0
# ERROR: 0
============================================================================
gmake[5]: Leaving directory '<https://ci.centos.org/job/libvirt-check/systems=libvirt-fedora-30/ws/build/gnulib/tests'>
gmake[4]: Leaving directory '<https://ci.centos.org/job/libvirt-check/systems=libvirt-fedora-30/ws/build/gnulib/tests'>
gmake[3]: Leaving directory '<https://ci.centos.org/job/libvirt-check/systems=libvirt-fedora-30/ws/build/gnulib/tests'>
gmake[2]: Leaving directory '<https://ci.centos.org/job/libvirt-check/systems=libvirt-fedora-30/ws/build/gnulib/tests'>
gmake[1]: Leaving directory '<https://ci.centos.org/job/libvirt-check/systems=libvirt-fedora-30/ws/build/gnulib/tests'>
Making check in tests
gmake[1]: Entering directory '<https://ci.centos.org/job/libvirt-check/systems=libvirt-fedora-30/ws/build/tests'>
/usr/bin/gmake   
gmake[2]: Entering directory '<https://ci.centos.org/job/libvirt-check/systems=libvirt-fedora-30/ws/build/tests'>
gmake[2]: Nothing to be done for 'all'.
gmake[2]: Leaving directory '<https://ci.centos.org/job/libvirt-check/systems=libvirt-fedora-30/ws/build/tests'>
/usr/bin/gmake  check-TESTS
gmake[2]: Entering directory '<https://ci.centos.org/job/libvirt-check/systems=libvirt-fedora-30/ws/build/tests'>
gmake[3]: Entering directory '<https://ci.centos.org/job/libvirt-check/systems=libvirt-fedora-30/ws/build/tests'>
PASS: virhostcputest
PASS: sockettest
PASS: virbuftest
PASS: seclabeltest
PASS: virhashtest
PASS: virconftest
PASS: viratomictest
PASS: utiltest
PASS: shunloadtest
PASS: virtimetest
PASS: commandtest
PASS: viruritest
PASS: viralloctest
PASS: virkeyfiletest
PASS: virauthconfigtest
PASS: virbitmaptest
PASS: vircryptotest
PASS: vircgrouptest
PASS: virendiantest
PASS: virpcitest
PASS: virfilecachetest
PASS: virfiletest
PASS: virfirewalltest
PASS: viriscsitest
PASS: virkeycodetest
PASS: virlockspacetest
PASS: virlogtest
PASS: virrotatingfiletest
PASS: virstringtest
PASS: virportallocatortest
PASS: sysinfotest
PASS: virkmodtest
PASS: virschematest
PASS: vircapstest
PASS: domainconftest
PASS: domaincapstest
PASS: virhostdevtest
PASS: virnetdevtest
PASS: virtypedparamtest
PASS: vshtabletest
PASS: virerrortest
PASS: virnetmessagetest
PASS: virnetsockettest
PASS: virnetdaemontest
PASS: virnetserverclienttest
PASS: virnettlscontexttest
PASS: virnettlssessiontest
PASS: fchosttest
PASS: scsihosttest
PASS: vircaps2xmltest
PASS: virresctrltest
PASS: fdstreamtest
PASS: virdbustest
PASS: virsystemdtest
PASS: virpolkittest
PASS: securityselinuxtest
PASS: viridentitytest
PASS: securityselinuxlabeltest
PASS: xlconfigtest
PASS: xmconfigtest
PASS: libxlxml2domconfigtest
PASS: qemuxml2xmltest
PASS: qemudomainsnapshotxml2xmltest
PASS: qemuxml2argvtest
PASS: qemuhotplugtest
PASS: qemumonitorjsontest
PASS: qemucapabilitiestest
PASS: qemuagenttest
PASS: qemumemlocktest
PASS: qemucaps2xmltest
PASS: qemucommandutiltest
PASS: qemublocktest
PASS: qemumigparamstest
PASS: qemufirmwaretest
PASS: lxcxml2xmltest
PASS: qemusecuritytest
PASS: lxcconf2xmltest
PASS: openvzutilstest
PASS: esxutilstest
PASS: vboxsnapshotxmltest
PASS: vmx2xmltest
PASS: xml2vmxtest
PASS: vmwarevertest
PASS: virjsontest
PASS: networkxml2xmlupdatetest
PASS: virnetworkportxml2xmltest
PASS: networkxml2xmltest
PASS: networkxml2conftest
PASS: networkxml2firewalltest
PASS: storagebackendsheepdogtest
PASS: nwfilterxml2xmltest
PASS: virnwfilterbindingxml2xmltest
PASS: nwfilterebiptablestest
PASS: nwfilterxml2firewalltest
PASS: storagevolxml2argvtest
PASS: virstorageutiltest
PASS: storagepoolxml2argvtest
PASS: storagepoolxml2xmltest
PASS: storagepoolcapstest
PASS: virscsitest
PASS: virstoragetest
PASS: nsstest
PASS: nssguesttest
PASS: storagevolxml2xmltest
PASS: nodedevxml2xmltest
PASS: interfacexml2xmltest
PASS: metadatatest
PASS: secretxml2xmltest
PASS: genericxml2xmltest
PASS: cputest
PASS: virusbtest
PASS: virnetdevbandwidthtest
PASS: eventtest
PASS: virdrivermoduletest
PASS: objecteventtest
PASS: virmacmaptest
PASS: virnetdevopenvswitchtest
PASS: libvirtd-pool
PASS: virsh-cpuset
PASS: libvirtd-fail
PASS: virsh-define-dev-segfault
PASS: virsh-int-overflow
PASS: virsh-read-bufsiz
PASS: virsh-read-non-seekable
PASS: virsh-schedinfo
PASS: virsh-self-test
PASS: virt-admin-self-test
PASS: virsh-snapshot
PASS: virsh-start
PASS: virsh-undefine
PASS: virsh-uriprecedence
FAIL: virsh-optparse
PASS: virsh-vcpupin
PASS: virshtest
============================================================================
Testsuite summary for libvirt 5.6.0
============================================================================
# TOTAL: 134
# PASS:  133
# SKIP:  0
# XFAIL: 0
# FAIL:  1
# XPASS: 0
# ERROR: 0
============================================================================
See tests/test-suite.log
Please report to libvir-list redhat com
============================================================================
gmake[3]: *** [Makefile:6028: test-suite.log] Error 1
gmake[3]: Leaving directory '<https://ci.centos.org/job/libvirt-check/systems=libvirt-fedora-30/ws/build/tests'>
gmake[2]: *** [Makefile:6136: check-TESTS] Error 2
gmake[2]: Leaving directory '<https://ci.centos.org/job/libvirt-check/systems=libvirt-fedora-30/ws/build/tests'>
gmake[1]: *** [Makefile:7176: check-am] Error 2
gmake[1]: Leaving directory '<https://ci.centos.org/job/libvirt-check/systems=libvirt-fedora-30/ws/build/tests'>
gmake: *** [Makefile:2127: check-recursive] Error 1
+ cat tests/test-suite.log
=========================================
   libvirt 5.6.0: tests/test-suite.log
=========================================

# TOTAL: 134
# PASS:  133
# SKIP:  0
# XFAIL: 0
# FAIL:  1
# XPASS: 0
# ERROR: 0

.. contents:: :depth: 2

FAIL: virsh-optparse
====================

FAIL virsh-optparse (exit status: 1)

+ exit 1
Build step 'Execute shell' marked build as failure


[Date Prev][Date Next]   [Thread Prev][Thread Next]   [Thread Index] [Date Index] [Author Index]