[Date Prev][Date Next]   [Thread Prev][Thread Next]   [Thread Index] [Date Index] [Author Index]

[Libvirt-ci] Build failed in Jenkins: libvirt-check » libvirt-debian-10 #555



See <https://ci.centos.org/job/libvirt-check/systems=libvirt-debian-10/555/display/redirect>

------------------------------------------
[...truncated 24.01 KB...]
PASS: test-areadlink
PASS: test-base64
PASS: test-arpa_inet
PASS: test-bind
PASS: test-binary-io.sh
PASS: test-bitrotate
SKIP: test-btowc1.sh
SKIP: test-btowc2.sh
PASS: test-byteswap
PASS: test-c-ctype
PASS: test-c-strcase.sh
PASS: test-canonicalize-lgpl
PASS: test-cloexec
PASS: test-chown
PASS: test-close
PASS: test-c-strcasestr
PASS: test-count-leading-zeros
PASS: test-connect
PASS: test-count-one-bits
PASS: test-ctype
PASS: test-dup
PASS: test-environ
PASS: test-dup2
PASS: test-errno
PASS: test-fclose
PASS: test-fcntl-h
PASS: test-fcntl
PASS: test-fflush
PASS: test-fdopen
PASS: test-fflush2.sh
PASS: test-fdatasync
PASS: test-fgetc
PASS: test-ffsl
PASS: test-ffs
PASS: test-float
PASS: test-fnmatch-h
PASS: test-fnmatch
PASS: test-fputc
PASS: test-fpurge
PASS: test-fread
PASS: test-fseek.sh
PASS: test-freading
PASS: test-fseek2.sh
PASS: test-fseeko.sh
PASS: test-fseeko3.sh
PASS: test-fseeko2.sh
PASS: test-fseeko4.sh
PASS: test-fstat
PASS: test-ftell2.sh
PASS: test-ftell.sh
PASS: test-ftell3
PASS: test-fsync
PASS: test-ftello.sh
PASS: test-ftello2.sh
PASS: test-ftello3
PASS: test-func
PASS: test-ftruncate.sh
PASS: test-ftello4.sh
PASS: test-fwrite
PASS: test-getdelim
PASS: test-getcwd-lgpl
PASS: test-getdtablesize
PASS: test-getgroups
PASS: test-gethostname
PASS: test-getline
PASS: test-getopt-posix
PASS: test-getpeername
PASS: test-getsockname
PASS: test-getprogname
PASS: test-getsockopt
PASS: test-gettimeofday
PASS: test-grantpt
PASS: test-ignore-value
PASS: test-inet_ntop
PASS: test-inet_pton
PASS: test-intprops
PASS: test-inttypes
PASS: test-ioctl
PASS: test-isatty
PASS: test-isblank
PASS: test-isnanf-nolibm
PASS: test-isnand-nolibm
PASS: test-langinfo
PASS: test-isnanl-nolibm
PASS: test-limits-h
PASS: test-ldexp
PASS: test-listen
PASS: test-locale
PASS: test-localeconv
PASS: test-localename
PASS: test-lstat
PASS: test-lseek.sh
PASS: test-math
PASS: test-malloca
SKIP: test-mbrtowc1.sh
SKIP: test-mbrtowc2.sh
SKIP: test-mbrtowc4.sh
PASS: test-mbrtowc5.sh
SKIP: test-mbrtowc3.sh
SKIP: test-mbrtowc-w32-1.sh
SKIP: test-mbrtowc-w32-2.sh
SKIP: test-mbrtowc-w32-4.sh
PASS: test-getaddrinfo
SKIP: test-mbrtowc-w32-3.sh
SKIP: test-mbrtowc-w32-5.sh
SKIP: test-mbsinit.sh
SKIP: test-mbsrtowcs1.sh
SKIP: test-mbsrtowcs2.sh
SKIP: test-mbsrtowcs3.sh
SKIP: test-mbsrtowcs4.sh
PASS: test-mkdir
PASS: test-net_if
PASS: test-netdb
PASS: test-netinet_in
PASS: test-nl_langinfo.sh
PASS: test-nanosleep
PASS: test-memchr
PASS: test-nonblocking
PASS: test-open
PASS: test-openpty
PASS: test-passfd
PASS: test-pathmax
PASS: test-perror.sh
PASS: test-perror2
PASS: test-pipe
PASS: test-pipe2
PASS: test-poll-h
FAIL: test-poll
PASS: test-posix_openpt
PASS: test-posix_spawn_file_actions_addclose
PASS: test-posix_spawn_file_actions_adddup2
PASS: test-posix_spawn_file_actions_addopen
PASS: test-posix_spawn1
PASS: test-posix_spawn2
PASS: test-pthread_sigmask1
PASS: test-nonblocking-pipe.sh
SKIP: test-ptsname
SKIP: test-ptsname_r
PASS: test-pthread_sigmask2
PASS: test-raise
PASS: test-rawmemchr
PASS: test-read
PASS: test-recv
PASS: test-readlink
PASS: test-regex
PASS: test-sched
PASS: test-select
PASS: test-select-out.sh
PASS: test-send
PASS: test-setenv
SKIP: test-setlocale1.sh
PASS: test-setlocale2.sh
PASS: test-setsockopt
PASS: test-sigaction
PASS: test-signal-h
PASS: test-signbit
PASS: test-sigpipe.sh
PASS: test-nonblocking-socket.sh
PASS: test-select-in.sh
PASS: test-snprintf
PASS: test-sockets
PASS: test-spawn
PASS: test-stat
PASS: test-stat-time
PASS: test-stdalign
PASS: test-stdbool
PASS: test-stddef
PASS: test-stdint
PASS: test-stdio
PASS: test-stdlib
PASS: test-strchrnul
PASS: test-strerror
PASS: test-sigprocmask
PASS: test-strerror_r
PASS: test-string
PASS: test-sleep
PASS: test-strings
PASS: test-strnlen
PASS: test-sys_ioctl
PASS: test-symlink
PASS: test-sys_select
PASS: test-sys_stat
PASS: test-sys_socket
PASS: test-sys_time
PASS: test-sys_uio
PASS: test-sys_types
PASS: test-sys_utsname
PASS: test-sys_wait
PASS: test-termios
PASS: test-thread_self
PASS: test-thread_create
PASS: test-time
SKIP: test-ttyname_r
PASS: test-uname
PASS: test-unistd
PASS: test-uc_width
PASS: test-unlockpt
PASS: test-unsetenv
PASS: test-init.sh
PASS: uniwidth/test-uc_width2.sh
PASS: test-vasnprintf
PASS: test-vasprintf
SKIP: test-vc-list-files-cvs.sh
PASS: test-verify
PASS: test-vc-list-files-git.sh
PASS: test-vsnprintf
PASS: test-wchar
PASS: test-wcrtomb.sh
SKIP: test-wcrtomb-w32-1.sh
PASS: test-usleep
SKIP: test-wcrtomb-w32-2.sh
SKIP: test-wcrtomb-w32-3.sh
SKIP: test-wcrtomb-w32-5.sh
SKIP: test-wcrtomb-w32-4.sh
PASS: test-wcwidth
PASS: test-wctype-h
PASS: test-write
PASS: test-xalloc-die.sh
PASS: test-verify.sh
============================================================================
Testsuite summary for libvirt 5.6.0
============================================================================
# TOTAL: 221
# PASS:  194
# SKIP:  26
# XFAIL: 0
# FAIL:  1
# XPASS: 0
# ERROR: 0
============================================================================
See gnulib/tests/test-suite.log
Please report to libvir-list redhat com
============================================================================
make[5]: *** [Makefile:5254: test-suite.log] Error 1
make[5]: Leaving directory '<https://ci.centos.org/job/libvirt-check/systems=libvirt-debian-10/ws/build/gnulib/tests'>
make[4]: *** [Makefile:5362: check-TESTS] Error 2
make[4]: Leaving directory '<https://ci.centos.org/job/libvirt-check/systems=libvirt-debian-10/ws/build/gnulib/tests'>
make[3]: *** [Makefile:7001: check-am] Error 2
make[3]: Leaving directory '<https://ci.centos.org/job/libvirt-check/systems=libvirt-debian-10/ws/build/gnulib/tests'>
make[2]: *** [Makefile:5146: check-recursive] Error 1
make[2]: Leaving directory '<https://ci.centos.org/job/libvirt-check/systems=libvirt-debian-10/ws/build/gnulib/tests'>
make[1]: *** [Makefile:7003: check] Error 2
make[1]: Leaving directory '<https://ci.centos.org/job/libvirt-check/systems=libvirt-debian-10/ws/build/gnulib/tests'>
make: *** [Makefile:2127: check-recursive] Error 1
+ cat tests/test-suite.log
cat: tests/test-suite.log: No such file or directory
+ true
+ exit 1
Build step 'Execute shell' marked build as failure


[Date Prev][Date Next]   [Thread Prev][Thread Next]   [Thread Index] [Date Index] [Author Index]