[Date Prev][Date Next]   [Thread Prev][Thread Next]   [Thread Index] [Date Index] [Author Index]

[Libvirt-ci] Build failed in Jenkins: virt-manager-ch eck » libvirt-debian-9 #797



See <https://ci.centos.org/job/virt-manager-check/systems=libvirt-debian-9/797/display/redirect>

------------------------------------------
[...truncated 4.80 KB...]
  File "virt-install", line 571, in build_guest_instance
    installer = build_installer(options, guest)
  File "virt-install", line 514, in build_installer
    autodistro = installer.detect_distro(guest)
  File "<https://ci.centos.org/job/virt-manager-check/systems=libvirt-debian-9/ws/virtinst/installer.py";,> line 354, in detect_distro
    ret = self._treemedia.detect_distro(guest)
  File "<https://ci.centos.org/job/virt-manager-check/systems=libvirt-debian-9/ws/virtinst/installertreemedia.py";,> line 261, in detect_distro
    cache = self._get_cached_data(guest, fetcher)
  File "<https://ci.centos.org/job/virt-manager-check/systems=libvirt-debian-9/ws/virtinst/installertreemedia.py";,> line 152, in _get_cached_data
    skip_error=has_location_kernel)
  File "<https://ci.centos.org/job/virt-manager-check/systems=libvirt-debian-9/ws/virtinst/urldetect.py";,> line 290, in getDistroStore
    if not sclass.is_valid(cache):
  File "<https://ci.centos.org/job/virt-manager-check/systems=libvirt-debian-9/ws/virtinst/urldetect.py";,> line 496, in is_valid
    if re.match(regex, cache.suse_content.product_name):
  File "/usr/lib/python3.5/re.py", line 163, in match
    return _compile(pattern, flags).match(string)
TypeError: expected string or bytes-like object


TESTSUITE: Expected command to pass, but it didn't.



======================================================================
FAIL: testCLI0086virt_install_fake_http (tests.clitest.CLITests)
----------------------------------------------------------------------
Traceback (most recent call last):
  File "<https://ci.centos.org/job/virt-manager-check/systems=libvirt-debian-9/ws/tests/clitest.py";,> line 1317, in <lambda>
    return lambda s: cmdtemplate(s, cmd)
  File "<https://ci.centos.org/job/virt-manager-check/systems=libvirt-debian-9/ws/tests/clitest.py";,> line 1316, in cmdtemplate
    _cmdobj.run(self)
  File "<https://ci.centos.org/job/virt-manager-check/systems=libvirt-debian-9/ws/tests/clitest.py";,> line 332, in run
    tests.fail(err)
AssertionError: ./virt-install --nographics --noautoconsole --nodisks --location https://foobar.com  --connect __virtinst_test__test://<https://ci.centos.org/job/virt-manager-check/systems=libvirt-debian-9/ws/tests/testsuite.xml,predictable> --name foobar --ram 64 --print-step all
Command was: ./virt-install --nographics --noautoconsole --nodisks --location https://foobar.com  --connect __virtinst_test__test://<https://ci.centos.org/job/virt-manager-check/systems=libvirt-debian-9/ws/tests/testsuite.xml,predictable> --name foobar --ram 64 --print-step all
Error code : -1
Output was:

Traceback (most recent call last):
  File "<https://ci.centos.org/job/virt-manager-check/systems=libvirt-debian-9/ws/tests/clitest.py";,> line 208, in _launch_command
    ret = virtinstall.main(conn=conn)
  File "virt-install", line 983, in main
    guest, installer = build_guest_instance(conn, options)
  File "virt-install", line 571, in build_guest_instance
    installer = build_installer(options, guest)
  File "virt-install", line 514, in build_installer
    autodistro = installer.detect_distro(guest)
  File "<https://ci.centos.org/job/virt-manager-check/systems=libvirt-debian-9/ws/virtinst/installer.py";,> line 354, in detect_distro
    ret = self._treemedia.detect_distro(guest)
  File "<https://ci.centos.org/job/virt-manager-check/systems=libvirt-debian-9/ws/virtinst/installertreemedia.py";,> line 261, in detect_distro
    cache = self._get_cached_data(guest, fetcher)
  File "<https://ci.centos.org/job/virt-manager-check/systems=libvirt-debian-9/ws/virtinst/installertreemedia.py";,> line 152, in _get_cached_data
    skip_error=has_location_kernel)
  File "<https://ci.centos.org/job/virt-manager-check/systems=libvirt-debian-9/ws/virtinst/urldetect.py";,> line 290, in getDistroStore
    if not sclass.is_valid(cache):
  File "<https://ci.centos.org/job/virt-manager-check/systems=libvirt-debian-9/ws/virtinst/urldetect.py";,> line 496, in is_valid
    if re.match(regex, cache.suse_content.product_name):
  File "/usr/lib/python3.5/re.py", line 163, in match
    return _compile(pattern, flags).match(string)
TypeError: expected string or bytes-like object


TESTSUITE: Expected command to pass, but it didn't.



======================================================================
FAIL: testCLI0087virt_install_osinfo_url (tests.clitest.CLITests)
----------------------------------------------------------------------
Traceback (most recent call last):
  File "<https://ci.centos.org/job/virt-manager-check/systems=libvirt-debian-9/ws/tests/clitest.py";,> line 1317, in <lambda>
    return lambda s: cmdtemplate(s, cmd)
  File "<https://ci.centos.org/job/virt-manager-check/systems=libvirt-debian-9/ws/tests/clitest.py";,> line 1316, in cmdtemplate
    _cmdobj.run(self)
  File "<https://ci.centos.org/job/virt-manager-check/systems=libvirt-debian-9/ws/tests/clitest.py";,> line 332, in run
    tests.fail(err)
AssertionError: ./virt-install --nographics --noautoconsole --nodisks --connect __virtinst_test__test://<https://ci.centos.org/job/virt-manager-check/systems=libvirt-debian-9/ws/tests/testdriver.xml,predictable,qemu,domcaps=/home/jenkins/virt-manager/tests/capabilities-xml/kvm-x86_64-domcaps.xml,caps=/home/jenkins/virt-manager/tests/capabilities-xml/kvm-x86_64.xml> --os-variant fedora26,install=location  --name foobar --ram 64 --print-step all
Command was: ./virt-install --nographics --noautoconsole --nodisks --connect __virtinst_test__test://<https://ci.centos.org/job/virt-manager-check/systems=libvirt-debian-9/ws/tests/testdriver.xml,predictable,qemu,domcaps=/home/jenkins/virt-manager/tests/capabilities-xml/kvm-x86_64-domcaps.xml,caps=/home/jenkins/virt-manager/tests/capabilities-xml/kvm-x86_64.xml> --os-variant fedora26,install=location  --name foobar --ram 64 --print-step all
Error code : -1
Output was:

Traceback (most recent call last):
  File "<https://ci.centos.org/job/virt-manager-check/systems=libvirt-debian-9/ws/tests/clitest.py";,> line 208, in _launch_command
    ret = virtinstall.main(conn=conn)
  File "virt-install", line 983, in main
    guest, installer = build_guest_instance(conn, options)
  File "virt-install", line 571, in build_guest_instance
    installer = build_installer(options, guest)
  File "virt-install", line 514, in build_installer
    autodistro = installer.detect_distro(guest)
  File "<https://ci.centos.org/job/virt-manager-check/systems=libvirt-debian-9/ws/virtinst/installer.py";,> line 354, in detect_distro
    ret = self._treemedia.detect_distro(guest)
  File "<https://ci.centos.org/job/virt-manager-check/systems=libvirt-debian-9/ws/virtinst/installertreemedia.py";,> line 261, in detect_distro
    cache = self._get_cached_data(guest, fetcher)
  File "<https://ci.centos.org/job/virt-manager-check/systems=libvirt-debian-9/ws/virtinst/installertreemedia.py";,> line 152, in _get_cached_data
    skip_error=has_location_kernel)
  File "<https://ci.centos.org/job/virt-manager-check/systems=libvirt-debian-9/ws/virtinst/urldetect.py";,> line 290, in getDistroStore
    if not sclass.is_valid(cache):
  File "<https://ci.centos.org/job/virt-manager-check/systems=libvirt-debian-9/ws/virtinst/urldetect.py";,> line 496, in is_valid
    if re.match(regex, cache.suse_content.product_name):
  File "/usr/lib/python3.5/re.py", line 163, in match
    return _compile(pattern, flags).match(string)
TypeError: expected string or bytes-like object


TESTSUITE: Expected command to pass, but it didn't.



======================================================================
FAIL: testCLI0088virt_install_osinfo_url_unattended (tests.clitest.CLITests)
----------------------------------------------------------------------
Traceback (most recent call last):
  File "<https://ci.centos.org/job/virt-manager-check/systems=libvirt-debian-9/ws/tests/clitest.py";,> line 1317, in <lambda>
    return lambda s: cmdtemplate(s, cmd)
  File "<https://ci.centos.org/job/virt-manager-check/systems=libvirt-debian-9/ws/tests/clitest.py";,> line 1316, in cmdtemplate
    _cmdobj.run(self)
  File "<https://ci.centos.org/job/virt-manager-check/systems=libvirt-debian-9/ws/tests/clitest.py";,> line 332, in run
    tests.fail(err)
AssertionError: ./virt-install --nographics --noautoconsole --nodisks --connect __virtinst_test__test://<https://ci.centos.org/job/virt-manager-check/systems=libvirt-debian-9/ws/tests/testdriver.xml,predictable,qemu,domcaps=/home/jenkins/virt-manager/tests/capabilities-xml/kvm-x86_64-domcaps.xml,caps=/home/jenkins/virt-manager/tests/capabilities-xml/kvm-x86_64.xml> --os-variant fedora26 --unattended profile=desktop,admin-password=foobar  --name foobar --ram 64 --print-step all
Command was: ./virt-install --nographics --noautoconsole --nodisks --connect __virtinst_test__test://<https://ci.centos.org/job/virt-manager-check/systems=libvirt-debian-9/ws/tests/testdriver.xml,predictable,qemu,domcaps=/home/jenkins/virt-manager/tests/capabilities-xml/kvm-x86_64-domcaps.xml,caps=/home/jenkins/virt-manager/tests/capabilities-xml/kvm-x86_64.xml> --os-variant fedora26 --unattended profile=desktop,admin-password=foobar  --name foobar --ram 64 --print-step all
Error code : -1
Output was:

Traceback (most recent call last):
  File "<https://ci.centos.org/job/virt-manager-check/systems=libvirt-debian-9/ws/tests/clitest.py";,> line 208, in _launch_command
    ret = virtinstall.main(conn=conn)
  File "virt-install", line 983, in main
    guest, installer = build_guest_instance(conn, options)
  File "virt-install", line 571, in build_guest_instance
    installer = build_installer(options, guest)
  File "virt-install", line 514, in build_installer
    autodistro = installer.detect_distro(guest)
  File "<https://ci.centos.org/job/virt-manager-check/systems=libvirt-debian-9/ws/virtinst/installer.py";,> line 354, in detect_distro
    ret = self._treemedia.detect_distro(guest)
  File "<https://ci.centos.org/job/virt-manager-check/systems=libvirt-debian-9/ws/virtinst/installertreemedia.py";,> line 261, in detect_distro
    cache = self._get_cached_data(guest, fetcher)
  File "<https://ci.centos.org/job/virt-manager-check/systems=libvirt-debian-9/ws/virtinst/installertreemedia.py";,> line 152, in _get_cached_data
    skip_error=has_location_kernel)
  File "<https://ci.centos.org/job/virt-manager-check/systems=libvirt-debian-9/ws/virtinst/urldetect.py";,> line 290, in getDistroStore
    if not sclass.is_valid(cache):
  File "<https://ci.centos.org/job/virt-manager-check/systems=libvirt-debian-9/ws/virtinst/urldetect.py";,> line 496, in is_valid
    if re.match(regex, cache.suse_content.product_name):
  File "/usr/lib/python3.5/re.py", line 163, in match
    return _compile(pattern, flags).match(string)
TypeError: expected string or bytes-like object


TESTSUITE: Expected command to pass, but it didn't.



======================================================================
FAIL: testCLI0089virt_install_osinfo_win7_unattended (tests.clitest.CLITests)
----------------------------------------------------------------------
Traceback (most recent call last):
  File "<https://ci.centos.org/job/virt-manager-check/systems=libvirt-debian-9/ws/tests/clitest.py";,> line 1317, in <lambda>
    return lambda s: cmdtemplate(s, cmd)
  File "<https://ci.centos.org/job/virt-manager-check/systems=libvirt-debian-9/ws/tests/clitest.py";,> line 1316, in cmdtemplate
    _cmdobj.run(self)
  File "<https://ci.centos.org/job/virt-manager-check/systems=libvirt-debian-9/ws/tests/clitest.py";,> line 332, in run
    tests.fail(err)
AssertionError: ./virt-install --nographics --noautoconsole --nodisks --connect __virtinst_test__test://<https://ci.centos.org/job/virt-manager-check/systems=libvirt-debian-9/ws/tests/testdriver.xml,predictable,qemu,domcaps=/home/jenkins/virt-manager/tests/capabilities-xml/kvm-x86_64-domcaps.xml,caps=/home/jenkins/virt-manager/tests/capabilities-xml/kvm-x86_64.xml> --os-variant win7 --cdrom /tmp/fake-win7.iso --unattended profile=desktop,admin-password=foobar  --name foobar --ram 64 --print-step all
Command was: ./virt-install --nographics --noautoconsole --nodisks --connect __virtinst_test__test://<https://ci.centos.org/job/virt-manager-check/systems=libvirt-debian-9/ws/tests/testdriver.xml,predictable,qemu,domcaps=/home/jenkins/virt-manager/tests/capabilities-xml/kvm-x86_64-domcaps.xml,caps=/home/jenkins/virt-manager/tests/capabilities-xml/kvm-x86_64.xml> --os-variant win7 --cdrom /tmp/fake-win7.iso --unattended profile=desktop,admin-password=foobar  --name foobar --ram 64 --print-step all
Error code : -1
Output was:

Traceback (most recent call last):
  File "<https://ci.centos.org/job/virt-manager-check/systems=libvirt-debian-9/ws/tests/clitest.py";,> line 208, in _launch_command
    ret = virtinstall.main(conn=conn)
  File "virt-install", line 985, in main
    xml = xml_to_print(guest, installer, options.xmlonly, options.dry)
  File "virt-install", line 755, in xml_to_print
    guest, dry=dry, return_xml=True)
  File "<https://ci.centos.org/job/virt-manager-check/systems=libvirt-debian-9/ws/virtinst/installer.py";,> line 500, in start_install
    self._prepare(guest, meter)
  File "<https://ci.centos.org/job/virt-manager-check/systems=libvirt-debian-9/ws/virtinst/installer.py";,> line 252, in _prepare
    self._prepare_unattended_data(guest, unattended_script)
  File "<https://ci.centos.org/job/virt-manager-check/systems=libvirt-debian-9/ws/virtinst/installer.py";,> line 222, in _prepare_unattended_data
    guest.conn.get_app_cache_dir())
  File "<https://ci.centos.org/job/virt-manager-check/systems=libvirt-debian-9/ws/virtinst/installerinject.py";,> line 99, in perform_cdrom_injections
    _run_iso_commands)
  File "<https://ci.centos.org/job/virt-manager-check/systems=libvirt-debian-9/ws/virtinst/installerinject.py";,> line 76, in _perform_generic_injections
    return cb(media, tempdir)
  File "<https://ci.centos.org/job/virt-manager-check/systems=libvirt-debian-9/ws/virtinst/installerinject.py";,> line 54, in _run_iso_commands
    output = subprocess.check_output(cmd, stderr=subprocess.STDOUT)
  File "/usr/lib/python3.5/subprocess.py", line 316, in check_output
    **kwargs).stdout
  File "/usr/lib/python3.5/subprocess.py", line 383, in run
    with Popen(*popenargs, **kwargs) as process:
  File "/usr/lib/python3.5/subprocess.py", line 676, in __init__
    restore_signals, start_new_session)
  File "/usr/lib/python3.5/subprocess.py", line 1282, in _execute_child
    raise child_exception_type(errno_num, err_msg)
FileNotFoundError: [Errno 2] No such file or directory: 'mkisofs'


TESTSUITE: Expected command to pass, but it didn't.



======================================================================
FAIL: testCLI0090virt_install_network_install_resources (tests.clitest.CLITests)
----------------------------------------------------------------------
Traceback (most recent call last):
  File "<https://ci.centos.org/job/virt-manager-check/systems=libvirt-debian-9/ws/tests/clitest.py";,> line 1317, in <lambda>
    return lambda s: cmdtemplate(s, cmd)
  File "<https://ci.centos.org/job/virt-manager-check/systems=libvirt-debian-9/ws/tests/clitest.py";,> line 1316, in cmdtemplate
    _cmdobj.run(self)
  File "<https://ci.centos.org/job/virt-manager-check/systems=libvirt-debian-9/ws/tests/clitest.py";,> line 332, in run
    tests.fail(err)
AssertionError: ./virt-install --nographics --noautoconsole --nodisks --connect __virtinst_test__test://<https://ci.centos.org/job/virt-manager-check/systems=libvirt-debian-9/ws/tests/testdriver.xml,predictable,qemu,domcaps=/home/jenkins/virt-manager/tests/capabilities-xml/kvm-x86_64-domcaps.xml,caps=/home/jenkins/virt-manager/tests/capabilities-xml/kvm-x86_64.xml> --os-variant silverblue29 --location http://example.com  --name foobar --ram 64 --print-step all
Command was: ./virt-install --nographics --noautoconsole --nodisks --connect __virtinst_test__test://<https://ci.centos.org/job/virt-manager-check/systems=libvirt-debian-9/ws/tests/testdriver.xml,predictable,qemu,domcaps=/home/jenkins/virt-manager/tests/capabilities-xml/kvm-x86_64-domcaps.xml,caps=/home/jenkins/virt-manager/tests/capabilities-xml/kvm-x86_64.xml> --os-variant silverblue29 --location http://example.com  --name foobar --ram 64 --print-step all
Error code : -1
Output was:

Traceback (most recent call last):
  File "<https://ci.centos.org/job/virt-manager-check/systems=libvirt-debian-9/ws/tests/clitest.py";,> line 208, in _launch_command
    ret = virtinstall.main(conn=conn)
  File "virt-install", line 983, in main
    guest, installer = build_guest_instance(conn, options)
  File "virt-install", line 571, in build_guest_instance
    installer = build_installer(options, guest)
  File "virt-install", line 514, in build_installer
    autodistro = installer.detect_distro(guest)
  File "<https://ci.centos.org/job/virt-manager-check/systems=libvirt-debian-9/ws/virtinst/installer.py";,> line 354, in detect_distro
    ret = self._treemedia.detect_distro(guest)
  File "<https://ci.centos.org/job/virt-manager-check/systems=libvirt-debian-9/ws/virtinst/installertreemedia.py";,> line 261, in detect_distro
    cache = self._get_cached_data(guest, fetcher)
  File "<https://ci.centos.org/job/virt-manager-check/systems=libvirt-debian-9/ws/virtinst/installertreemedia.py";,> line 152, in _get_cached_data
    skip_error=has_location_kernel)
  File "<https://ci.centos.org/job/virt-manager-check/systems=libvirt-debian-9/ws/virtinst/urldetect.py";,> line 290, in getDistroStore
    if not sclass.is_valid(cache):
  File "<https://ci.centos.org/job/virt-manager-check/systems=libvirt-debian-9/ws/virtinst/urldetect.py";,> line 496, in is_valid
    if re.match(regex, cache.suse_content.product_name):
  File "/usr/lib/python3.5/re.py", line 163, in match
    return _compile(pattern, flags).match(string)
TypeError: expected string or bytes-like object


TESTSUITE: Expected command to pass, but it didn't.



----------------------------------------------------------------------
Ran 491 tests in 63.280s

FAILED (failures=6, skipped=22)
Build step 'Execute shell' marked build as failure


[Date Prev][Date Next]   [Thread Prev][Thread Next]   [Thread Index] [Date Index] [Author Index]