[Date Prev][Date Next]   [Thread Prev][Thread Next]   [Thread Index] [Date Index] [Author Index]

[Libvirt-ci] Build failed in Jenkins: libvirt-dbus-ch eck » libvirt-fedora-rawhide #434



See <https://ci.centos.org/job/libvirt-dbus-check/systems=libvirt-fedora-rawhide/434/display/redirect>

------------------------------------------
[...truncated 24.29 KB...]
        # no need to validate other args - MethodCallMessage ctor will do
    
        get_args_opts = dict(byte_arrays=byte_arrays)
        if is_py2:
            get_args_opts['utf8_strings'] = kwargs.get('utf8_strings', False)
        elif 'utf8_strings' in kwargs:
            raise TypeError("unexpected keyword argument 'utf8_strings'")
    
        message = MethodCallMessage(destination=bus_name,
                                    path=object_path,
                                    interface=dbus_interface,
                                    method=method)
        # Add the arguments to the function
        try:
            message.append(signature=signature, *args)
        except Exception as e:
            logging.basicConfig()
            _logger.error('Unable to set arguments %r according to '
                          'signature %r: %s: %s',
                          args, signature, e.__class__, e)
            raise
    
        # make a blocking call
        reply_message = self.send_message_with_reply_and_block(
>           message, timeout)
E       dbus.exceptions.DBusException: org.libvirt.Error: Requested operation is not valid: storage pool 'default-pool' is not active

/usr/lib64/python3.7/site-packages/dbus/connection.py:651: DBusException
=================================== FAILURES ===================================
____________ TestStoragePool.test_storage_pool_list_storage_volumes ____________

self = <test_storage.TestStoragePool object at 0x7f6d848a78d0>

    def test_storage_pool_list_storage_volumes(self):
        _, test_storage_pool = self.get_test_storage_pool()
        interface_obj = dbus.Interface(test_storage_pool,
                                       'org.libvirt.StoragePool')
>       storage_vols = interface_obj.ListStorageVolumes(0)

../../tests/test_storage.py:88: 
_ _ _ _ _ _ _ _ _ _ _ _ _ _ _ _ _ _ _ _ _ _ _ _ _ _ _ _ _ _ _ _ _ _ _ _ _ _ _ _ 
/usr/lib64/python3.7/site-packages/dbus/proxies.py:70: in __call__
    return self._proxy_method(*args, **keywords)
/usr/lib64/python3.7/site-packages/dbus/proxies.py:145: in __call__
    **keywords)
_ _ _ _ _ _ _ _ _ _ _ _ _ _ _ _ _ _ _ _ _ _ _ _ _ _ _ _ _ _ _ _ _ _ _ _ _ _ _ _ 

self = <dbus._dbus.SessionBus (session) at 0x7f6d84a219e8>
bus_name = dbus.String(':1.4')
object_path = dbus.ObjectPath('/org/libvirt/Test/storagepool/_dfe224cb_28fb_8dd0_c4b2_64eb3f0f4566')
dbus_interface = 'org.libvirt.StoragePool', method = 'ListStorageVolumes'
signature = 'u', args = (0,), timeout = -1.0, byte_arrays = False, kwargs = {}
get_args_opts = {'byte_arrays': False}
message = <dbus.lowlevel.MethodCallMessage path: /org/libvirt/Test/storagepool/_dfe224cb_28fb_8dd0_c4b2_64eb3f0f4566, iface: org.libvirt.StoragePool, member: ListStorageVolumes dest: :1.4>

    def call_blocking(self, bus_name, object_path, dbus_interface, method,
                      signature, args, timeout=-1.0,
                      byte_arrays=False, **kwargs):
        """Call the given method, synchronously.
        :Since: 0.81.0
        """
        if object_path == LOCAL_PATH:
            raise DBusException('Methods may not be called on the reserved '
                                'path %s' % LOCAL_PATH)
        if dbus_interface == LOCAL_IFACE:
            raise DBusException('Methods may not be called on the reserved '
                                'interface %s' % LOCAL_IFACE)
        # no need to validate other args - MethodCallMessage ctor will do
    
        get_args_opts = dict(byte_arrays=byte_arrays)
        if is_py2:
            get_args_opts['utf8_strings'] = kwargs.get('utf8_strings', False)
        elif 'utf8_strings' in kwargs:
            raise TypeError("unexpected keyword argument 'utf8_strings'")
    
        message = MethodCallMessage(destination=bus_name,
                                    path=object_path,
                                    interface=dbus_interface,
                                    method=method)
        # Add the arguments to the function
        try:
            message.append(signature=signature, *args)
        except Exception as e:
            logging.basicConfig()
            _logger.error('Unable to set arguments %r according to '
                          'signature %r: %s: %s',
                          args, signature, e.__class__, e)
            raise
    
        # make a blocking call
        reply_message = self.send_message_with_reply_and_block(
>           message, timeout)
E       dbus.exceptions.DBusException: org.libvirt.Error: Requested operation is not valid: storage pool is not active

/usr/lib64/python3.7/site-packages/dbus/connection.py:651: DBusException
--------------------------- Captured stderr teardown ---------------------------
Disconnected from D-Bus.
__________________ TestStoragePool.test_storage_pool_undefine __________________

self = <test_storage.TestStoragePool object at 0x7f6d847d0898>

    def test_storage_pool_undefine(self):
        def storage_pool_undefined(path, event, _detail):
            if event != libvirttest.StoragePoolEvent.UNDEFINED:
                return
            assert isinstance(path, dbus.ObjectPath)
            self.loop.quit()
    
        self.connect.connect_to_signal('StoragePoolEvent',
                                       storage_pool_undefined)
    
        _, test_storage_pool = self.get_test_storage_pool()
        interface_obj = dbus.Interface(test_storage_pool,
                                       'org.libvirt.StoragePool')
>       interface_obj.Destroy()

../../tests/test_storage.py:116: 
_ _ _ _ _ _ _ _ _ _ _ _ _ _ _ _ _ _ _ _ _ _ _ _ _ _ _ _ _ _ _ _ _ _ _ _ _ _ _ _ 
/usr/lib64/python3.7/site-packages/dbus/proxies.py:70: in __call__
    return self._proxy_method(*args, **keywords)
/usr/lib64/python3.7/site-packages/dbus/proxies.py:145: in __call__
    **keywords)
_ _ _ _ _ _ _ _ _ _ _ _ _ _ _ _ _ _ _ _ _ _ _ _ _ _ _ _ _ _ _ _ _ _ _ _ _ _ _ _ 

self = <dbus._dbus.SessionBus (session) at 0x7f6d84a219e8>
bus_name = dbus.String(':1.4')
object_path = dbus.ObjectPath('/org/libvirt/Test/storagepool/_dfe224cb_28fb_8dd0_c4b2_64eb3f0f4566')
dbus_interface = 'org.libvirt.StoragePool', method = 'Destroy', signature = ''
args = (), timeout = -1.0, byte_arrays = False, kwargs = {}
get_args_opts = {'byte_arrays': False}
message = <dbus.lowlevel.MethodCallMessage path: /org/libvirt/Test/storagepool/_dfe224cb_28fb_8dd0_c4b2_64eb3f0f4566, iface: org.libvirt.StoragePool, member: Destroy dest: :1.4>

    def call_blocking(self, bus_name, object_path, dbus_interface, method,
                      signature, args, timeout=-1.0,
                      byte_arrays=False, **kwargs):
        """Call the given method, synchronously.
        :Since: 0.81.0
        """
        if object_path == LOCAL_PATH:
            raise DBusException('Methods may not be called on the reserved '
                                'path %s' % LOCAL_PATH)
        if dbus_interface == LOCAL_IFACE:
            raise DBusException('Methods may not be called on the reserved '
                                'interface %s' % LOCAL_IFACE)
        # no need to validate other args - MethodCallMessage ctor will do
    
        get_args_opts = dict(byte_arrays=byte_arrays)
        if is_py2:
            get_args_opts['utf8_strings'] = kwargs.get('utf8_strings', False)
        elif 'utf8_strings' in kwargs:
            raise TypeError("unexpected keyword argument 'utf8_strings'")
    
        message = MethodCallMessage(destination=bus_name,
                                    path=object_path,
                                    interface=dbus_interface,
                                    method=method)
        # Add the arguments to the function
        try:
            message.append(signature=signature, *args)
        except Exception as e:
            logging.basicConfig()
            _logger.error('Unable to set arguments %r according to '
                          'signature %r: %s: %s',
                          args, signature, e.__class__, e)
            raise
    
        # make a blocking call
        reply_message = self.send_message_with_reply_and_block(
>           message, timeout)
E       dbus.exceptions.DBusException: org.libvirt.Error: Requested operation is not valid: storage pool 'default-pool' is not active

/usr/lib64/python3.7/site-packages/dbus/connection.py:651: DBusException
--------------------------- Captured stderr teardown ---------------------------
Disconnected from D-Bus.
__________________ TestStoragePool.test_storage_pool_refresh ___________________

self = <test_storage.TestStoragePool object at 0x7f6d848add30>

    def test_storage_pool_refresh(self):
        _, test_storage_pool = self.get_test_storage_pool()
        interface_obj = dbus.Interface(test_storage_pool,
                                       'org.libvirt.StoragePool')
        interface_obj.connect_to_signal('Refresh',
                                        lambda: self.loop.quit())
>       interface_obj.Refresh(0)

../../tests/test_storage.py:127: 
_ _ _ _ _ _ _ _ _ _ _ _ _ _ _ _ _ _ _ _ _ _ _ _ _ _ _ _ _ _ _ _ _ _ _ _ _ _ _ _ 
/usr/lib64/python3.7/site-packages/dbus/proxies.py:70: in __call__
    return self._proxy_method(*args, **keywords)
/usr/lib64/python3.7/site-packages/dbus/proxies.py:145: in __call__
    **keywords)
_ _ _ _ _ _ _ _ _ _ _ _ _ _ _ _ _ _ _ _ _ _ _ _ _ _ _ _ _ _ _ _ _ _ _ _ _ _ _ _ 

self = <dbus._dbus.SessionBus (session) at 0x7f6d84a219e8>
bus_name = dbus.String(':1.4')
object_path = dbus.ObjectPath('/org/libvirt/Test/storagepool/_dfe224cb_28fb_8dd0_c4b2_64eb3f0f4566')
dbus_interface = 'org.libvirt.StoragePool', method = 'Refresh', signature = 'u'
args = (0,), timeout = -1.0, byte_arrays = False, kwargs = {}
get_args_opts = {'byte_arrays': False}
message = <dbus.lowlevel.MethodCallMessage path: /org/libvirt/Test/storagepool/_dfe224cb_28fb_8dd0_c4b2_64eb3f0f4566, iface: org.libvirt.StoragePool, member: Refresh dest: :1.4>

    def call_blocking(self, bus_name, object_path, dbus_interface, method,
                      signature, args, timeout=-1.0,
                      byte_arrays=False, **kwargs):
        """Call the given method, synchronously.
        :Since: 0.81.0
        """
        if object_path == LOCAL_PATH:
            raise DBusException('Methods may not be called on the reserved '
                                'path %s' % LOCAL_PATH)
        if dbus_interface == LOCAL_IFACE:
            raise DBusException('Methods may not be called on the reserved '
                                'interface %s' % LOCAL_IFACE)
        # no need to validate other args - MethodCallMessage ctor will do
    
        get_args_opts = dict(byte_arrays=byte_arrays)
        if is_py2:
            get_args_opts['utf8_strings'] = kwargs.get('utf8_strings', False)
        elif 'utf8_strings' in kwargs:
            raise TypeError("unexpected keyword argument 'utf8_strings'")
    
        message = MethodCallMessage(destination=bus_name,
                                    path=object_path,
                                    interface=dbus_interface,
                                    method=method)
        # Add the arguments to the function
        try:
            message.append(signature=signature, *args)
        except Exception as e:
            logging.basicConfig()
            _logger.error('Unable to set arguments %r according to '
                          'signature %r: %s: %s',
                          args, signature, e.__class__, e)
            raise
    
        # make a blocking call
        reply_message = self.send_message_with_reply_and_block(
>           message, timeout)
E       dbus.exceptions.DBusException: org.libvirt.Error: Requested operation is not valid: storage pool 'default-pool' is not active

/usr/lib64/python3.7/site-packages/dbus/connection.py:651: DBusException
--------------------------- Captured stderr teardown ---------------------------
Disconnected from D-Bus.
================= 3 failed, 7 passed, 6 error in 16.70 seconds =================
FAIL test_storage.py (exit status: 1)

+ exit 1
Build step 'Execute shell' marked build as failure


[Date Prev][Date Next]   [Thread Prev][Thread Next]   [Thread Index] [Date Index] [Author Index]