[Date Prev][Date Next]   [Thread Prev][Thread Next]   [Thread Index] [Date Index] [Author Index]

[Libvirt-ci] Build failed in Jenkins: libvirt-dbus-ch eck » libvirt-fedora-rawhide #450



See <https://ci.centos.org/job/libvirt-dbus-check/systems=libvirt-fedora-rawhide/450/display/redirect>

------------------------------------------
[...truncated 3.78 KB...]
Making check in data
gmake[1]: Entering directory '<https://ci.centos.org/job/libvirt-dbus-check/systems=libvirt-fedora-rawhide/ws/build/data'>
gmake[1]: Nothing to be done for 'check'.
gmake[1]: Leaving directory '<https://ci.centos.org/job/libvirt-dbus-check/systems=libvirt-fedora-rawhide/ws/build/data'>
Making check in docs
gmake[1]: Entering directory '<https://ci.centos.org/job/libvirt-dbus-check/systems=libvirt-fedora-rawhide/ws/build/docs'>
gmake[1]: Nothing to be done for 'check'.
gmake[1]: Leaving directory '<https://ci.centos.org/job/libvirt-dbus-check/systems=libvirt-fedora-rawhide/ws/build/docs'>
Making check in src
gmake[1]: Entering directory '<https://ci.centos.org/job/libvirt-dbus-check/systems=libvirt-fedora-rawhide/ws/build/src'>
gmake[1]: Nothing to be done for 'check'.
gmake[1]: Leaving directory '<https://ci.centos.org/job/libvirt-dbus-check/systems=libvirt-fedora-rawhide/ws/build/src'>
Making check in tests
gmake[1]: Entering directory '<https://ci.centos.org/job/libvirt-dbus-check/systems=libvirt-fedora-rawhide/ws/build/tests'>
/usr/bin/gmake  test_util
gmake[2]: Entering directory '<https://ci.centos.org/job/libvirt-dbus-check/systems=libvirt-fedora-rawhide/ws/build/tests'>
  CC       test_util-test_util.o
  CCLD     test_util
gmake[2]: Leaving directory '<https://ci.centos.org/job/libvirt-dbus-check/systems=libvirt-fedora-rawhide/ws/build/tests'>
/usr/bin/gmake  check-TESTS
gmake[2]: Entering directory '<https://ci.centos.org/job/libvirt-dbus-check/systems=libvirt-fedora-rawhide/ws/build/tests'>
gmake[3]: Entering directory '<https://ci.centos.org/job/libvirt-dbus-check/systems=libvirt-fedora-rawhide/ws/build/tests'>
PASS: test_util
FAIL: test_interface.py
PASS: test_domain.py
PASS: test_network.py
PASS: test_nodedev.py
PASS: test_connect.py
PASS: test_storage.py
============================================================================
Testsuite summary for libvirt-dbus 1.4.0
============================================================================
# TOTAL: 7
# PASS:  6
# SKIP:  0
# XFAIL: 0
# FAIL:  1
# XPASS: 0
# ERROR: 0
============================================================================
See tests/test-suite.log
Please report to libvir-list redhat com
============================================================================
gmake[3]: *** [Makefile:766: test-suite.log] Error 1
gmake[3]: Leaving directory '<https://ci.centos.org/job/libvirt-dbus-check/systems=libvirt-fedora-rawhide/ws/build/tests'>
gmake[2]: *** [Makefile:874: check-TESTS] Error 2
gmake[2]: Leaving directory '<https://ci.centos.org/job/libvirt-dbus-check/systems=libvirt-fedora-rawhide/ws/build/tests'>
gmake[1]: *** [Makefile:990: check-am] Error 2
gmake[1]: Leaving directory '<https://ci.centos.org/job/libvirt-dbus-check/systems=libvirt-fedora-rawhide/ws/build/tests'>
gmake: *** [Makefile:460: check-recursive] Error 1
+ cat tests/test-suite.log
==============================================
   libvirt-dbus 1.4.0: tests/test-suite.log
==============================================

# TOTAL: 7
# PASS:  6
# SKIP:  0
# XFAIL: 0
# FAIL:  1
# XPASS: 0
# ERROR: 0

.. contents:: :depth: 2

FAIL: test_interface.py
=======================

============================= test session starts ==============================
platform linux -- Python 3.7.3, pytest-4.4.1, py-1.8.0, pluggy-0.11.0
rootdir: <https://ci.centos.org/job/libvirt-dbus-check/systems=libvirt-fedora-rawhide/ws/>
collected 5 items

../../tests/test_interface.py E..EE                                      [100%]

==================================== ERRORS ====================================
___________ ERROR at setup of TestInterface.test_interface_undefine ____________

self = <test_interface.TestInterface object at 0x7fe66c339550>
request = <SubRequest 'libvirt_dbus_setup' for <Function test_interface_undefine>>

    @pytest.fixture(autouse=True)
    def libvirt_dbus_setup(self, request):
        """Start libvirt-dbus for each test function
        """
        os.environ['LIBVIRT_DEBUG'] = '3'
        self.libvirt_dbus = subprocess.Popen([exe, '--session'])
        self.bus = dbus.SessionBus()
    
        for i in range(10):
            if self.bus.name_has_owner('org.libvirt'):
                break
            time.sleep(0.1)
        else:
>           raise TimeoutError('error starting libvirt-dbus')
E           TimeoutError: error starting libvirt-dbus

../../tests/libvirttest.py:44: TimeoutError
---------------------------- Captured stderr setup -----------------------------
dbus-daemon[24515]: Cannot setup inotify for '/home/jenkins/.local/share/dbus-1/services'; error 'Permission denied'
______ ERROR at setup of TestInterface.test_interface_get_xml_description ______

self = <test_interface.TestInterface object at 0x7fe66c31ecc0>

    @pytest.fixture
    def interface_create(self):
        """ Fixture to define dummy interface on the test driver
    
        This fixture should be used in the setup of every test manipulating
        with interfaces.
        """
        path = self.connect.InterfaceDefineXML(xmldata.minimal_interface_xml, 0)
        obj = self.bus.get_object('org.libvirt', path)
        interface_obj = dbus.Interface(obj, 'org.libvirt.Interface')
>       interface_obj.Create(0)

../../tests/libvirttest.py:84: 
_ _ _ _ _ _ _ _ _ _ _ _ _ _ _ _ _ _ _ _ _ _ _ _ _ _ _ _ _ _ _ _ _ _ _ _ _ _ _ _ 
/usr/lib64/python3.7/site-packages/dbus/proxies.py:70: in __call__
    return self._proxy_method(*args, **keywords)
/usr/lib64/python3.7/site-packages/dbus/proxies.py:145: in __call__
    **keywords)
_ _ _ _ _ _ _ _ _ _ _ _ _ _ _ _ _ _ _ _ _ _ _ _ _ _ _ _ _ _ _ _ _ _ _ _ _ _ _ _ 

self = <dbus._dbus.SessionBus (session) at 0x7fe66c35cdb0>
bus_name = dbus.String(':1.1')
object_path = dbus.ObjectPath('/org/libvirt/Test/interface/11_3a22_3a33_3a44_3a55_3a66')
dbus_interface = 'org.libvirt.Interface', method = 'Create', signature = 'u'
args = (0,), timeout = -1.0, byte_arrays = False, kwargs = {}
get_args_opts = {'byte_arrays': False}
message = <dbus.lowlevel.MethodCallMessage path: /org/libvirt/Test/interface/11_3a22_3a33_3a44_3a55_3a66, iface: org.libvirt.Interface, member: Create dest: :1.1>

    def call_blocking(self, bus_name, object_path, dbus_interface, method,
                      signature, args, timeout=-1.0,
                      byte_arrays=False, **kwargs):
        """Call the given method, synchronously.
        :Since: 0.81.0
        """
        if object_path == LOCAL_PATH:
            raise DBusException('Methods may not be called on the reserved '
                                'path %s' % LOCAL_PATH)
        if dbus_interface == LOCAL_IFACE:
            raise DBusException('Methods may not be called on the reserved '
                                'interface %s' % LOCAL_IFACE)
        # no need to validate other args - MethodCallMessage ctor will do
    
        get_args_opts = dict(byte_arrays=byte_arrays)
        if is_py2:
            get_args_opts['utf8_strings'] = kwargs.get('utf8_strings', False)
        elif 'utf8_strings' in kwargs:
            raise TypeError("unexpected keyword argument 'utf8_strings'")
    
        message = MethodCallMessage(destination=bus_name,
                                    path=object_path,
                                    interface=dbus_interface,
                                    method=method)
        # Add the arguments to the function
        try:
            message.append(signature=signature, *args)
        except Exception as e:
            logging.basicConfig()
            _logger.error('Unable to set arguments %r according to '
                          'signature %r: %s: %s',
                          args, signature, e.__class__, e)
            raise
    
        # make a blocking call
        reply_message = self.send_message_with_reply_and_block(
>           message, timeout)
E       dbus.exceptions.DBusException: org.libvirt.Error: Requested operation is not valid

/usr/lib64/python3.7/site-packages/dbus/connection.py:651: DBusException
________ ERROR at setup of TestInterface.test_interface_properties_type ________

self = <test_interface.TestInterface object at 0x7fe66c129828>

    @pytest.fixture
    def interface_create(self):
        """ Fixture to define dummy interface on the test driver
    
        This fixture should be used in the setup of every test manipulating
        with interfaces.
        """
        path = self.connect.InterfaceDefineXML(xmldata.minimal_interface_xml, 0)
        obj = self.bus.get_object('org.libvirt', path)
        interface_obj = dbus.Interface(obj, 'org.libvirt.Interface')
>       interface_obj.Create(0)

../../tests/libvirttest.py:84: 
_ _ _ _ _ _ _ _ _ _ _ _ _ _ _ _ _ _ _ _ _ _ _ _ _ _ _ _ _ _ _ _ _ _ _ _ _ _ _ _ 
/usr/lib64/python3.7/site-packages/dbus/proxies.py:70: in __call__
    return self._proxy_method(*args, **keywords)
/usr/lib64/python3.7/site-packages/dbus/proxies.py:145: in __call__
    **keywords)
_ _ _ _ _ _ _ _ _ _ _ _ _ _ _ _ _ _ _ _ _ _ _ _ _ _ _ _ _ _ _ _ _ _ _ _ _ _ _ _ 

self = <dbus._dbus.SessionBus (session) at 0x7fe66c35cdb0>
bus_name = dbus.String(':1.1')
object_path = dbus.ObjectPath('/org/libvirt/Test/interface/11_3a22_3a33_3a44_3a55_3a66')
dbus_interface = 'org.libvirt.Interface', method = 'Create', signature = 'u'
args = (0,), timeout = -1.0, byte_arrays = False, kwargs = {}
get_args_opts = {'byte_arrays': False}
message = <dbus.lowlevel.MethodCallMessage path: /org/libvirt/Test/interface/11_3a22_3a33_3a44_3a55_3a66, iface: org.libvirt.Interface, member: Create dest: :1.1>

    def call_blocking(self, bus_name, object_path, dbus_interface, method,
                      signature, args, timeout=-1.0,
                      byte_arrays=False, **kwargs):
        """Call the given method, synchronously.
        :Since: 0.81.0
        """
        if object_path == LOCAL_PATH:
            raise DBusException('Methods may not be called on the reserved '
                                'path %s' % LOCAL_PATH)
        if dbus_interface == LOCAL_IFACE:
            raise DBusException('Methods may not be called on the reserved '
                                'interface %s' % LOCAL_IFACE)
        # no need to validate other args - MethodCallMessage ctor will do
    
        get_args_opts = dict(byte_arrays=byte_arrays)
        if is_py2:
            get_args_opts['utf8_strings'] = kwargs.get('utf8_strings', False)
        elif 'utf8_strings' in kwargs:
            raise TypeError("unexpected keyword argument 'utf8_strings'")
    
        message = MethodCallMessage(destination=bus_name,
                                    path=object_path,
                                    interface=dbus_interface,
                                    method=method)
        # Add the arguments to the function
        try:
            message.append(signature=signature, *args)
        except Exception as e:
            logging.basicConfig()
            _logger.error('Unable to set arguments %r according to '
                          'signature %r: %s: %s',
                          args, signature, e.__class__, e)
            raise
    
        # make a blocking call
        reply_message = self.send_message_with_reply_and_block(
>           message, timeout)
E       dbus.exceptions.DBusException: org.libvirt.Error: Requested operation is not valid

/usr/lib64/python3.7/site-packages/dbus/connection.py:651: DBusException
====================== 2 passed, 3 error in 4.76 seconds =======================
FAIL test_interface.py (exit status: 1)

+ exit 1
Build step 'Execute shell' marked build as failure


[Date Prev][Date Next]   [Thread Prev][Thread Next]   [Thread Index] [Date Index] [Author Index]