[Date Prev][Date Next]   [Thread Prev][Thread Next]   [Thread Index] [Date Index] [Author Index]

Build failed in Jenkins: libvirt -check » libvirt-freebsd-11 #1190



See <https://ci.centos.org/job/libvirt-check/systems=libvirt-freebsd-11/1190/display/redirect>

------------------------------------------
[...truncated 2.85 KB...]
Making all in .
gmake[5]: Entering directory '/usr<https://ci.centos.org/job/libvirt-check/systems=libvirt-freebsd-11/ws/build'>
gmake[5]: Leaving directory '/usr<https://ci.centos.org/job/libvirt-check/systems=libvirt-freebsd-11/ws/build'>
Making all in include/libvirt
gmake[5]: Entering directory '/usr<https://ci.centos.org/job/libvirt-check/systems=libvirt-freebsd-11/ws/build/include/libvirt'>
gmake[5]: Nothing to be done for 'all'.
gmake[5]: Leaving directory '/usr<https://ci.centos.org/job/libvirt-check/systems=libvirt-freebsd-11/ws/build/include/libvirt'>
Making all in src
gmake[5]: Entering directory '/usr<https://ci.centos.org/job/libvirt-check/systems=libvirt-freebsd-11/ws/build/src'>
/usr/local/bin/gmake  all-am
gmake[6]: Entering directory '/usr<https://ci.centos.org/job/libvirt-check/systems=libvirt-freebsd-11/ws/build/src'>
gmake[6]: Nothing to be done for 'all-am'.
gmake[6]: Leaving directory '/usr<https://ci.centos.org/job/libvirt-check/systems=libvirt-freebsd-11/ws/build/src'>
gmake[5]: Leaving directory '/usr<https://ci.centos.org/job/libvirt-check/systems=libvirt-freebsd-11/ws/build/src'>
Making all in tools
gmake[5]: Entering directory '/usr<https://ci.centos.org/job/libvirt-check/systems=libvirt-freebsd-11/ws/build/tools'>
/usr/local/bin/gmake  all-am
gmake[6]: Entering directory '/usr<https://ci.centos.org/job/libvirt-check/systems=libvirt-freebsd-11/ws/build/tools'>
gmake[6]: Nothing to be done for 'all-am'.
gmake[6]: Leaving directory '/usr<https://ci.centos.org/job/libvirt-check/systems=libvirt-freebsd-11/ws/build/tools'>
gmake[5]: Leaving directory '/usr<https://ci.centos.org/job/libvirt-check/systems=libvirt-freebsd-11/ws/build/tools'>
Making all in docs
gmake[5]: Entering directory '/usr<https://ci.centos.org/job/libvirt-check/systems=libvirt-freebsd-11/ws/build/docs'>
gmake[5]: Leaving directory '/usr<https://ci.centos.org/job/libvirt-check/systems=libvirt-freebsd-11/ws/build/docs'>
Making all in tests
gmake[5]: Entering directory '/usr<https://ci.centos.org/job/libvirt-check/systems=libvirt-freebsd-11/ws/build/tests'>
gmake[5]: Nothing to be done for 'all'.
gmake[5]: Leaving directory '/usr<https://ci.centos.org/job/libvirt-check/systems=libvirt-freebsd-11/ws/build/tests'>
Making all in po
gmake[5]: Entering directory '/usr<https://ci.centos.org/job/libvirt-check/systems=libvirt-freebsd-11/ws/build/po'>
cat: POTFILES: No such file or directory
gmake[5]: Nothing to be done for 'all'.
gmake[5]: Leaving directory '/usr<https://ci.centos.org/job/libvirt-check/systems=libvirt-freebsd-11/ws/build/po'>
Making all in examples
gmake[5]: Entering directory '/usr<https://ci.centos.org/job/libvirt-check/systems=libvirt-freebsd-11/ws/build/examples'>
gmake[5]: Nothing to be done for 'all'.
gmake[5]: Leaving directory '/usr<https://ci.centos.org/job/libvirt-check/systems=libvirt-freebsd-11/ws/build/examples'>
gmake[4]: Leaving directory '/usr<https://ci.centos.org/job/libvirt-check/systems=libvirt-freebsd-11/ws/build'>
gmake[3]: Leaving directory '/usr<https://ci.centos.org/job/libvirt-check/systems=libvirt-freebsd-11/ws/build'>
gmake[2]: Leaving directory '/usr<https://ci.centos.org/job/libvirt-check/systems=libvirt-freebsd-11/ws/build'>
Making check in include/libvirt
gmake[2]: Entering directory '/usr<https://ci.centos.org/job/libvirt-check/systems=libvirt-freebsd-11/ws/build/include/libvirt'>
gmake[2]: Nothing to be done for 'check'.
gmake[2]: Leaving directory '/usr<https://ci.centos.org/job/libvirt-check/systems=libvirt-freebsd-11/ws/build/include/libvirt'>
Making check in src
gmake[2]: Entering directory '/usr<https://ci.centos.org/job/libvirt-check/systems=libvirt-freebsd-11/ws/build/src'>
/usr/local/bin/gmake  check-am
gmake[3]: Entering directory '/usr<https://ci.centos.org/job/libvirt-check/systems=libvirt-freebsd-11/ws/build/src'>
/usr/local/bin/gmake  check-local
gmake[4]: Entering directory '/usr<https://ci.centos.org/job/libvirt-check/systems=libvirt-freebsd-11/ws/build/src'>
  GEN      ../../src/remote_protocol-struct
  GEN      ../../src/lxc_protocol-struct
  GEN      ../../src/qemu_protocol-struct
WARNING: skipping pdwtags test with Clang
  GEN      ../../src/virnetprotocol-struct
WARNING: skipping pdwtags test with Clang
WARNING: skipping pdwtags test with Clang
  GEN      ../../src/virkeepaliveprotocol-struct
  GEN      ../../src/lock_protocol-struct
WARNING: skipping pdwtags test with Clang
  GEN      ../../src/admin_protocol-struct
WARNING: skipping pdwtags test with Clang
  GEN      check-symsorting
WARNING: skipping pdwtags test with Clang
  GEN      check-drivername
WARNING: skipping pdwtags test with Clang
  GEN      check-driverimpls
  GEN      check-aclrules
  GEN      check-aclperms
  GEN      check-admin-symsorting
  GEN      check-admin-drivername
  GEN      check-augeas
gmake[4]: Leaving directory '/usr<https://ci.centos.org/job/libvirt-check/systems=libvirt-freebsd-11/ws/build/src'>
gmake[3]: Leaving directory '/usr<https://ci.centos.org/job/libvirt-check/systems=libvirt-freebsd-11/ws/build/src'>
gmake[2]: Leaving directory '/usr<https://ci.centos.org/job/libvirt-check/systems=libvirt-freebsd-11/ws/build/src'>
Making check in tools
gmake[2]: Entering directory '/usr<https://ci.centos.org/job/libvirt-check/systems=libvirt-freebsd-11/ws/build/tools'>
/usr/local/bin/gmake  check-am
gmake[3]: Entering directory '/usr<https://ci.centos.org/job/libvirt-check/systems=libvirt-freebsd-11/ws/build/tools'>
gmake[3]: Nothing to be done for 'check-am'.
gmake[3]: Leaving directory '/usr<https://ci.centos.org/job/libvirt-check/systems=libvirt-freebsd-11/ws/build/tools'>
gmake[2]: Leaving directory '/usr<https://ci.centos.org/job/libvirt-check/systems=libvirt-freebsd-11/ws/build/tools'>
Making check in docs
gmake[2]: Entering directory '/usr<https://ci.centos.org/job/libvirt-check/systems=libvirt-freebsd-11/ws/build/docs'>
/usr/local/bin/gmake  check-local
gmake[3]: Entering directory '/usr<https://ci.centos.org/job/libvirt-check/systems=libvirt-freebsd-11/ws/build/docs'>
/usr/local/bin/xmllint --nonet --noout html/*.html
gmake[3]: Leaving directory '/usr<https://ci.centos.org/job/libvirt-check/systems=libvirt-freebsd-11/ws/build/docs'>
gmake[2]: Leaving directory '/usr<https://ci.centos.org/job/libvirt-check/systems=libvirt-freebsd-11/ws/build/docs'>
Making check in tests
gmake[2]: Entering directory '/usr<https://ci.centos.org/job/libvirt-check/systems=libvirt-freebsd-11/ws/build/tests'>
/usr/local/bin/gmake   
gmake[3]: Entering directory '/usr<https://ci.centos.org/job/libvirt-check/systems=libvirt-freebsd-11/ws/build/tests'>
gmake[3]: Nothing to be done for 'all'.
gmake[3]: Leaving directory '/usr<https://ci.centos.org/job/libvirt-check/systems=libvirt-freebsd-11/ws/build/tests'>
/usr/local/bin/gmake  check-TESTS
gmake[3]: Entering directory '/usr<https://ci.centos.org/job/libvirt-check/systems=libvirt-freebsd-11/ws/build/tests'>
gmake[4]: Entering directory '/usr<https://ci.centos.org/job/libvirt-check/systems=libvirt-freebsd-11/ws/build/tests'>
SKIP: virhostcputest
PASS: sockettest
PASS: virbuftest
PASS: seclabeltest
PASS: virhashtest
PASS: virconftest
PASS: utiltest
SKIP: shunloadtest
PASS: virtimetest
PASS: viruritest
PASS: viralloctest
PASS: virauthconfigtest
PASS: virbitmaptest
SKIP: vircgrouptest
PASS: commandtest
PASS: vircryptotest
PASS: virendiantest
SKIP: virpcitest
PASS: virfiletest
PASS: virfilecachetest
PASS: viriscsitest
SKIP: virfirewalltest
PASS: virkeycodetest
PASS: virlockspacetest
PASS: virlogtest
PASS: virrotatingfiletest
PASS: virstringtest
SKIP: virportallocatortest
PASS: sysinfotest
SKIP: virkmodtest
PASS: vircapstest
PASS: domaincapstest
PASS: domainconftest
SKIP: virhostdevtest
SKIP: virnetdevtest
PASS: virtypedparamtest
PASS: vshtabletest
PASS: virerrortest
PASS: virnetmessagetest
PASS: virnetsockettest
PASS: virnetdaemontest
PASS: virnetserverclienttest
SKIP: virnettlscontexttest
SKIP: virnettlssessiontest
PASS: fdstreamtest
PASS: virdbustest
SKIP: virsystemdtest
PASS: virpolkittest
PASS: virshtest
PASS: qemuxml2xmltest
PASS: qemudomaincheckpointxml2xmltest
PASS: qemudomainsnapshotxml2xmltest
PASS: virschematest
PASS: qemumonitorjsontest
PASS: qemuagenttest
PASS: qemucapabilitiestest
Segmentation fault (core dumped)
FAIL: qemuhotplugtest
PASS: qemucaps2xmltest
PASS: qemuxml2argvtest
PASS: qemucommandutiltest
PASS: qemumemlocktest
PASS: qemumigparamstest
PASS: qemufirmwaretest
PASS: qemuvhostusertest
PASS: esxutilstest
PASS: vboxsnapshotxmltest
PASS: qemublocktest
PASS: vmx2xmltest
PASS: vmwarevertest
PASS: qemusecuritytest
PASS: xml2vmxtest
PASS: bhyvexml2argvtest
PASS: virjsontest
PASS: bhyvexml2xmltest
PASS: bhyveargv2xmltest
PASS: virnetworkportxml2xmltest
PASS: networkxml2xmlupdatetest
PASS: networkxml2xmltest
SKIP: networkxml2firewalltest
PASS: virnwfilterbindingxml2xmltest
PASS: networkxml2conftest
PASS: storagepoolxml2argvtest
PASS: nwfilterxml2xmltest
PASS: storagevolxml2argvtest
PASS: storagepoolxml2xmltest
PASS: virstorageutiltest
PASS: storagepoolcapstest
PASS: storagevolxml2xmltest
PASS: nsstest
PASS: nssguesttest
PASS: interfacexml2xmltest
PASS: nodedevxml2xmltest
PASS: metadatatest
PASS: secretxml2xmltest
PASS: eventtest
PASS: virdrivermoduletest
PASS: genericxml2xmltest
PASS: virdriverconnvalidatetest
PASS: objecteventtest
PASS: virnetdevopenvswitchtest
PASS: virmacmaptest
PASS: libvirtd-fail
PASS: libvirtd-pool
PASS: virsh-auth
PASS: virsh-cpuset
PASS: virsh-define-dev-segfault
SKIP: virsh-optparse
PASS: virsh-int-overflow
PASS: virsh-read-bufsiz
PASS: virsh-read-non-seekable
PASS: virsh-schedinfo
PASS: virsh-self-test
PASS: virt-admin-self-test
PASS: virsh-checkpoint
PASS: virsh-start
PASS: virsh-snapshot
PASS: virsh-undefine
PASS: virsh-uriprecedence
PASS: virsh-vcpupin
PASS: cputest
============================================================================
Testsuite summary for libvirt 6.4.0
============================================================================
# TOTAL: 120
# PASS:  105
# SKIP:  14
# XFAIL: 0
# FAIL:  1
# XPASS: 0
# ERROR: 0
============================================================================
See tests/test-suite.log
Please report to libvir-list redhat com
============================================================================
gmake[4]: *** [Makefile:4840: test-suite.log] Error 1
gmake[4]: Leaving directory '/usr<https://ci.centos.org/job/libvirt-check/systems=libvirt-freebsd-11/ws/build/tests'>
gmake[3]: *** [Makefile:4948: check-TESTS] Error 2
gmake[3]: Leaving directory '/usr<https://ci.centos.org/job/libvirt-check/systems=libvirt-freebsd-11/ws/build/tests'>
gmake[2]: *** [Makefile:6002: check-am] Error 2
gmake[2]: Leaving directory '/usr<https://ci.centos.org/job/libvirt-check/systems=libvirt-freebsd-11/ws/build/tests'>
gmake[1]: *** [Makefile:777: check-recursive] Error 1
gmake[1]: Leaving directory '/usr<https://ci.centos.org/job/libvirt-check/systems=libvirt-freebsd-11/ws/build'>
gmake: *** [Makefile:1072: check] Error 2
+ find -name test-suite.log
+ xargs cat
find: illegal option -- n
usage: find [-H | -L | -P] [-EXdsx] [-f path] path ... [expression]
       find [-H | -L | -P] [-EXdsx] -f path [path ...] [expression]
+ exit 1
Build step 'Execute shell' marked build as failure


[Date Prev][Date Next]   [Thread Prev][Thread Next]   [Thread Index] [Date Index] [Author Index]