[Date Prev][Date Next]   [Thread Prev][Thread Next]   [Thread Index] [Date Index] [Author Index]

Build failed in Jenkins: libvir t-check » libvirt-debian-9 #1192



See <https://ci.centos.org/job/libvirt-check/systems=libvirt-debian-9/1192/display/redirect>

------------------------------------------
[...truncated 6.16 KB...]
WARNING: die__process_unit: DW_TAG_restrict_type (0x37) @ <0x19e> not handled!
WARNING: skipping the remote protocol test
WARNING: no output, pdwtags appears broken:
WARNING: die__process_unit: DW_TAG_restrict_type (0x37) @ <0x193> not handled!
WARNING: skipping the remote protocol test
  GEN      ../../src/admin_protocol-struct
WARNING: no output, pdwtags appears broken:
WARNING: die__process_unit: DW_TAG_restrict_type (0x37) @ <0x193> not handled!
WARNING: skipping the remote protocol test
WARNING: no output, pdwtags appears broken:
WARNING: die__process_unit: DW_TAG_restrict_type (0x37) @ <0x19e> not handled!
WARNING: skipping the remote protocol test
  GEN      check-symsorting
  GEN      check-symfile
  GEN      check-drivername
  GEN      check-driverimpls
  GEN      check-aclrules
  GEN      check-aclperms
  GEN      check-admin-symfile
  GEN      check-admin-symsorting
  GEN      check-admin-drivername
  GEN      check-augeas
make[4]: Leaving directory '<https://ci.centos.org/job/libvirt-check/systems=libvirt-debian-9/ws/build/src'>
make[3]: Leaving directory '<https://ci.centos.org/job/libvirt-check/systems=libvirt-debian-9/ws/build/src'>
make[2]: Leaving directory '<https://ci.centos.org/job/libvirt-check/systems=libvirt-debian-9/ws/build/src'>
Making check in tools
make[2]: Entering directory '<https://ci.centos.org/job/libvirt-check/systems=libvirt-debian-9/ws/build/tools'>
/usr/bin/make  check-am
make[3]: Entering directory '<https://ci.centos.org/job/libvirt-check/systems=libvirt-debian-9/ws/build/tools'>
make[3]: Nothing to be done for 'check-am'.
make[3]: Leaving directory '<https://ci.centos.org/job/libvirt-check/systems=libvirt-debian-9/ws/build/tools'>
make[2]: Leaving directory '<https://ci.centos.org/job/libvirt-check/systems=libvirt-debian-9/ws/build/tools'>
Making check in docs
make[2]: Entering directory '<https://ci.centos.org/job/libvirt-check/systems=libvirt-debian-9/ws/build/docs'>
/usr/bin/make  check-local
make[3]: Entering directory '<https://ci.centos.org/job/libvirt-check/systems=libvirt-debian-9/ws/build/docs'>
/usr/bin/xmllint --nonet --noout html/*.html
make[3]: Leaving directory '<https://ci.centos.org/job/libvirt-check/systems=libvirt-debian-9/ws/build/docs'>
make[2]: Leaving directory '<https://ci.centos.org/job/libvirt-check/systems=libvirt-debian-9/ws/build/docs'>
Making check in tests
make[2]: Entering directory '<https://ci.centos.org/job/libvirt-check/systems=libvirt-debian-9/ws/build/tests'>
/usr/bin/make   
make[3]: Entering directory '<https://ci.centos.org/job/libvirt-check/systems=libvirt-debian-9/ws/build/tests'>
make[3]: Nothing to be done for 'all'.
make[3]: Leaving directory '<https://ci.centos.org/job/libvirt-check/systems=libvirt-debian-9/ws/build/tests'>
/usr/bin/make  check-TESTS
make[3]: Entering directory '<https://ci.centos.org/job/libvirt-check/systems=libvirt-debian-9/ws/build/tests'>
make[4]: Entering directory '<https://ci.centos.org/job/libvirt-check/systems=libvirt-debian-9/ws/build/tests'>
PASS: sockettest
PASS: virhostcputest
PASS: virbuftest
PASS: seclabeltest
PASS: virhashtest
PASS: commandtest
PASS: virconftest
PASS: shunloadtest
PASS: utiltest
PASS: virtimetest
PASS: viruritest
PASS: virauthconfigtest
PASS: viralloctest
PASS: virbitmaptest
PASS: vircgrouptest
PASS: vircryptotest
PASS: virpcitest
PASS: virendiantest
PASS: virfilecachetest
PASS: virfirewalltest
PASS: virfiletest
PASS: viriscsitest
PASS: virkeycodetest
PASS: virlockspacetest
PASS: virlogtest
PASS: virrotatingfiletest
PASS: virstringtest
PASS: virportallocatortest
PASS: sysinfotest
PASS: virkmodtest
PASS: vircapstest
PASS: domaincapstest
PASS: domainconftest
PASS: virhostdevtest
PASS: virnetdevtest
PASS: virtypedparamtest
PASS: vshtabletest
PASS: virerrortest
PASS: virnetmessagetest
PASS: virnetsockettest
PASS: virnetdaemontest
PASS: virnetserverclienttest
PASS: virschematest
PASS: virshtest
PASS: virnettlssessiontest
PASS: fchosttest
PASS: scsihosttest
PASS: vircaps2xmltest
PASS: virresctrltest
PASS: fdstreamtest
PASS: virdbustest
PASS: virsystemdtest
PASS: virpolkittest
PASS: securityselinuxtest
PASS: viridentitytest
PASS: securityselinuxlabeltest
PASS: xlconfigtest
PASS: xmconfigtest
PASS: libxlxml2domconfigtest
PASS: virnettlscontexttest
PASS: qemudomaincheckpointxml2xmltest
PASS: qemudomainsnapshotxml2xmltest
PASS: qemumonitorjsontest
PASS: qemuhotplugtest
PASS: qemuagenttest
PASS: qemuxml2xmltest
PASS: qemucaps2xmltest
PASS: qemumemlocktest
PASS: qemucommandutiltest
PASS: qemublocktest
PASS: qemumigparamstest
PASS: qemucapabilitiestest
PASS: qemufirmwaretest
PASS: qemuvhostusertest
PASS: lxcxml2xmltest
PASS: lxcconf2xmltest
PASS: openvzutilstest
PASS: esxutilstest
PASS: vboxsnapshotxmltest
PASS: vmx2xmltest
PASS: xml2vmxtest
PASS: vmwarevertest
PASS: virjsontest
PASS: networkxml2xmlupdatetest
PASS: virnetworkportxml2xmltest
PASS: qemusecuritytest
PASS: networkxml2xmltest
PASS: networkxml2conftest
PASS: networkxml2firewalltest
PASS: storagebackendsheepdogtest
PASS: nwfilterxml2xmltest
PASS: virnwfilterbindingxml2xmltest
PASS: nwfilterebiptablestest
PASS: nwfilterxml2firewalltest
PASS: storagevolxml2argvtest
PASS: storagepoolxml2argvtest
PASS: virstorageutiltest
PASS: storagepoolcapstest
PASS: storagepoolxml2xmltest
PASS: virscsitest
PASS: nsstest
PASS: nssguesttest
PASS: storagevolxml2xmltest
PASS: nodedevxml2xmltest
PASS: virstoragetest
PASS: interfacexml2xmltest
PASS: metadatatest
PASS: secretxml2xmltest
PASS: genericxml2xmltest
PASS: virusbtest
PASS: virnetdevbandwidthtest
../../build-aux/test-driver: line 107: 12982 Segmentation fault      "$@" > $log_file 2>&1
FAIL: eventtest
PASS: virdrivermoduletest
PASS: virdriverconnvalidatetest
PASS: objecteventtest
PASS: virmacmaptest
PASS: virnetdevopenvswitchtest
PASS: libvirtd-fail
PASS: cputest
PASS: libvirtd-pool
PASS: virsh-auth
PASS: virsh-define-dev-segfault
PASS: virsh-cpuset
PASS: virsh-int-overflow
PASS: virsh-read-bufsiz
PASS: virsh-read-non-seekable
PASS: virsh-schedinfo
PASS: virsh-self-test
PASS: virt-admin-self-test
PASS: virsh-checkpoint
PASS: qemuxml2argvtest
PASS: virsh-snapshot
PASS: virsh-start
PASS: virsh-undefine
PASS: virsh-uriprecedence
PASS: virsh-optparse
PASS: virsh-vcpupin
PASS: virt-aa-helper-test
============================================================================
Testsuite summary for libvirt 6.5.0
============================================================================
# TOTAL: 138
# PASS:  137
# SKIP:  0
# XFAIL: 0
# FAIL:  1
# XPASS: 0
# ERROR: 0
============================================================================
See tests/test-suite.log
Please report to libvir-list redhat com
============================================================================
Makefile:4704: recipe for target 'test-suite.log' failed
make[4]: *** [test-suite.log] Error 1
make[4]: Leaving directory '<https://ci.centos.org/job/libvirt-check/systems=libvirt-debian-9/ws/build/tests'>
Makefile:4810: recipe for target 'check-TESTS' failed
make[3]: *** [check-TESTS] Error 2
make[3]: Leaving directory '<https://ci.centos.org/job/libvirt-check/systems=libvirt-debian-9/ws/build/tests'>
Makefile:5863: recipe for target 'check-am' failed
make[2]: *** [check-am] Error 2
make[2]: Leaving directory '<https://ci.centos.org/job/libvirt-check/systems=libvirt-debian-9/ws/build/tests'>
Makefile:777: recipe for target 'check-recursive' failed
make[1]: *** [check-recursive] Error 1
make[1]: Leaving directory '<https://ci.centos.org/job/libvirt-check/systems=libvirt-debian-9/ws/build'>
Makefile:1069: recipe for target 'check' failed
make: *** [check] Error 2
+ xargs cat
+ find -name test-suite.log
=========================================
   libvirt 6.5.0: tests/test-suite.log
=========================================

# TOTAL: 138
# PASS:  137
# SKIP:  0
# XFAIL: 0
# FAIL:  1
# XPASS: 0
# ERROR: 0

.. contents:: :depth: 2

FAIL: eventtest
===============

TEST: eventtest
 1) Simple write                                                      ... OK
 2) Deleted before poll                                               ... OK
 3) Interrupted during poll                                           ... OK
 4) Deleted during dispatch                                           ... OK
 5) Deleted during dispatch                                           ... OK
 6) Firing a timer                                                    ... OK
 7) Deleted before poll                                               ... OK
 8) Interrupted during poll                                           ... OK
 9) Deleted during dispatch                                           ... OK
10) Deleted during dispatch                                           ... OK
FAIL eventtest (exit status: 139)

+ exit 1
Build step 'Execute shell' marked build as failure


[Date Prev][Date Next]   [Thread Prev][Thread Next]   [Thread Index] [Date Index] [Author Index]