[Date Prev][Date Next]   [Thread Prev][Thread Next]   [Thread Index] [Date Index] [Author Index]

libvirt-go-xml | Pipeline #155073692 has failed for master | dd07f98a



Title: libvirt-go-xml | Pipeline #155073692 has failed for master | dd07f98a
GitLab
✖ Your pipeline has failed.
 
Project libvirt / libvirt-go-xml
Branch
master
Commit
dd07f98a
Add 'downscript' for domain interfaces Signed...
Commit Author
Daniel Berrange
 
Pipeline #155073692 triggered by Daniel Berrange
had 5 failed builds.
Logs may contain sensitive data. Please consider before forwarding this email.
✖ build
go_1_11

Skipping Git submodules setup
Restoring cache
Downloading artifacts
Running before_script and script
$ go test -timeout 10m -tags xmlroundtrip -v
=== RUN TestDomainSnapshot
--- PASS: TestDomainSnapshot (0.00s)
=== RUN TestDomain
--- PASS: TestDomain (0.01s)
=== RUN TestNetwork
--- PASS: TestNetwork (0.00s)
=== RUN TestNodeDevice
--- PASS: TestNodeDevice (0.00s)
=== RUN TestSecret
--- PASS: TestSecret (0.00s)
=== RUN TestStoragePool
--- PASS: TestStoragePool (0.00s)
=== RUN TestStorageVolume
--- PASS: TestStorageVolume (0.00s)
=== RUN TestRoundTrip
--- FAIL: TestRoundTrip (61.41s)
xml_test.go:374: testdata/libvirt/tests/domaincapsdata/qemu_1.5.3-q35.x86_64.xml: /domainCapabilities[0]/cpu[0]/mode[0]/enum[0]: element in expected XML missing in actual XML
FAIL
exit status 1
FAIL _/builds/libvirt/libvirt-go-xml 61.429s
Running after_script
Uploading artifacts for failed job
ERROR: Job failed: exit code 1
✖ build
go_1_13

Skipping Git submodules setup
Restoring cache
Downloading artifacts
Running before_script and script
$ go test -timeout 10m -tags xmlroundtrip -v
=== RUN TestDomainSnapshot
--- PASS: TestDomainSnapshot (0.00s)
=== RUN TestDomain
--- PASS: TestDomain (0.01s)
=== RUN TestNetwork
--- PASS: TestNetwork (0.00s)
=== RUN TestNodeDevice
--- PASS: TestNodeDevice (0.00s)
=== RUN TestSecret
--- PASS: TestSecret (0.00s)
=== RUN TestStoragePool
--- PASS: TestStoragePool (0.00s)
=== RUN TestStorageVolume
--- PASS: TestStorageVolume (0.00s)
=== RUN TestRoundTrip
--- FAIL: TestRoundTrip (60.73s)
xml_test.go:374: testdata/libvirt/tests/domaincapsdata/qemu_1.5.3-q35.x86_64.xml: /domainCapabilities[0]/cpu[0]/mode[0]/enum[0]: element in expected XML missing in actual XML
FAIL
exit status 1
FAIL _/builds/libvirt/libvirt-go-xml 60.748s
Running after_script
Uploading artifacts for failed job
ERROR: Job failed: exit code 1
✖ build
go_1_10

Skipping Git submodules setup
Restoring cache
Downloading artifacts
Running before_script and script
$ go test -timeout 10m -tags xmlroundtrip -v
=== RUN TestDomainSnapshot
--- PASS: TestDomainSnapshot (0.00s)
=== RUN TestDomain
--- PASS: TestDomain (0.01s)
=== RUN TestNetwork
--- PASS: TestNetwork (0.00s)
=== RUN TestNodeDevice
--- PASS: TestNodeDevice (0.00s)
=== RUN TestSecret
--- PASS: TestSecret (0.00s)
=== RUN TestStoragePool
--- PASS: TestStoragePool (0.00s)
=== RUN TestStorageVolume
--- PASS: TestStorageVolume (0.00s)
=== RUN TestRoundTrip
--- FAIL: TestRoundTrip (64.40s)
xml_test.go:374: testdata/libvirt/tests/domaincapsdata/qemu_1.5.3-q35.x86_64.xml: /domainCapabilities[0]/cpu[0]/mode[0]/enum[0]: element in expected XML missing in actual XML
FAIL
exit status 1
FAIL _/builds/libvirt/libvirt-go-xml 64.416s
Running after_script
Uploading artifacts for failed job
ERROR: Job failed: exit code 1
✖ build
go_1_14

Skipping Git submodules setup
Restoring cache
Downloading artifacts
Running before_script and script
$ go test -timeout 10m -tags xmlroundtrip -v
=== RUN TestDomainSnapshot
--- PASS: TestDomainSnapshot (0.00s)
=== RUN TestDomain
--- PASS: TestDomain (0.01s)
=== RUN TestNetwork
--- PASS: TestNetwork (0.00s)
=== RUN TestNodeDevice
--- PASS: TestNodeDevice (0.00s)
=== RUN TestSecret
--- PASS: TestSecret (0.00s)
=== RUN TestStoragePool
--- PASS: TestStoragePool (0.00s)
=== RUN TestStorageVolume
--- PASS: TestStorageVolume (0.00s)
=== RUN TestRoundTrip
TestRoundTrip: xml_test.go:374: testdata/libvirt/tests/domaincapsdata/qemu_1.5.3-q35.x86_64.xml: /domainCapabilities[0]/cpu[0]/mode[0]/enum[0]: element in expected XML missing in actual XML
--- FAIL: TestRoundTrip (59.68s)
FAIL
exit status 1
FAIL _/builds/libvirt/libvirt-go-xml 59.692s
Running after_script
Uploading artifacts for failed job
ERROR: Job failed: exit code 1
✖ build
go_1_12

Skipping Git submodules setup
Restoring cache
Downloading artifacts
Running before_script and script
$ go test -timeout 10m -tags xmlroundtrip -v
=== RUN TestDomainSnapshot
--- PASS: TestDomainSnapshot (0.00s)
=== RUN TestDomain
--- PASS: TestDomain (0.01s)
=== RUN TestNetwork
--- PASS: TestNetwork (0.00s)
=== RUN TestNodeDevice
--- PASS: TestNodeDevice (0.00s)
=== RUN TestSecret
--- PASS: TestSecret (0.00s)
=== RUN TestStoragePool
--- PASS: TestStoragePool (0.00s)
=== RUN TestStorageVolume
--- PASS: TestStorageVolume (0.00s)
=== RUN TestRoundTrip
--- FAIL: TestRoundTrip (61.96s)
xml_test.go:374: testdata/libvirt/tests/domaincapsdata/qemu_1.5.3-q35.x86_64.xml: /domainCapabilities[0]/cpu[0]/mode[0]/enum[0]: element in expected XML missing in actual XML
FAIL
exit status 1
FAIL _/builds/libvirt/libvirt-go-xml 61.968s
Running after_script
Uploading artifacts for failed job
ERROR: Job failed: exit code 1

[Date Prev][Date Next]   [Thread Prev][Thread Next]   [Thread Index] [Date Index] [Author Index]