[Date Prev][Date Next]   [Thread Prev][Thread Next]   [Thread Index] [Date Index] [Author Index]

libvirt-go-xml | Pipeline #155975950 has failed for master | dd07f98a



Title: libvirt-go-xml | Pipeline #155975950 has failed for master | dd07f98a
GitLab
✖ Your pipeline has failed.
 
Project libvirt / libvirt-go-xml
Branch
master
Commit
dd07f98a
Add 'downscript' for domain interfaces Signed...
Commit Author
Daniel Berrange
 
Pipeline #155975950 triggered by Daniel Berrange
had 5 failed builds.
Logs may contain sensitive data. Please consider before forwarding this email.
✖ build
go_1_11

Skipping Git submodules setup
Restoring cache
Downloading artifacts
Running before_script and script
$ go test -timeout 10m -tags xmlroundtrip -v
=== RUN TestDomainSnapshot
--- PASS: TestDomainSnapshot (0.00s)
=== RUN TestDomain
--- PASS: TestDomain (0.01s)
=== RUN TestNetwork
--- PASS: TestNetwork (0.00s)
=== RUN TestNodeDevice
--- PASS: TestNodeDevice (0.00s)
=== RUN TestSecret
--- PASS: TestSecret (0.00s)
=== RUN TestStoragePool
--- PASS: TestStoragePool (0.00s)
=== RUN TestStorageVolume
--- PASS: TestStorageVolume (0.00s)
=== RUN TestRoundTrip
--- FAIL: TestRoundTrip (54.76s)
xml_test.go:374: testdata/libvirt/tests/domaincapsdata/qemu_1.5.3-q35.x86_64.xml: /domainCapabilities[0]/cpu[0]/mode[0]/enum[0]: element in expected XML missing in actual XML
FAIL
exit status 1
FAIL _/builds/libvirt/libvirt-go-xml 54.774s
Running after_script
Uploading artifacts for failed job
ERROR: Job failed: exit code 1
✖ build
go_1_12

Skipping Git submodules setup
Restoring cache
Downloading artifacts
Running before_script and script
$ go test -timeout 10m -tags xmlroundtrip -v
=== RUN TestDomainSnapshot
--- PASS: TestDomainSnapshot (0.00s)
=== RUN TestDomain
--- PASS: TestDomain (0.01s)
=== RUN TestNetwork
--- PASS: TestNetwork (0.00s)
=== RUN TestNodeDevice
--- PASS: TestNodeDevice (0.00s)
=== RUN TestSecret
--- PASS: TestSecret (0.00s)
=== RUN TestStoragePool
--- PASS: TestStoragePool (0.00s)
=== RUN TestStorageVolume
--- PASS: TestStorageVolume (0.00s)
=== RUN TestRoundTrip
--- FAIL: TestRoundTrip (55.56s)
xml_test.go:374: testdata/libvirt/tests/domaincapsdata/qemu_1.5.3-q35.x86_64.xml: /domainCapabilities[0]/cpu[0]/mode[0]/enum[0]: element in expected XML missing in actual XML
FAIL
exit status 1
FAIL _/builds/libvirt/libvirt-go-xml 55.572s
Running after_script
Uploading artifacts for failed job
ERROR: Job failed: exit code 1
✖ build
go_1_13

Skipping Git submodules setup
Restoring cache
Downloading artifacts
Running before_script and script
$ go test -timeout 10m -tags xmlroundtrip -v
=== RUN TestDomainSnapshot
--- PASS: TestDomainSnapshot (0.00s)
=== RUN TestDomain
--- PASS: TestDomain (0.01s)
=== RUN TestNetwork
--- PASS: TestNetwork (0.00s)
=== RUN TestNodeDevice
--- PASS: TestNodeDevice (0.00s)
=== RUN TestSecret
--- PASS: TestSecret (0.00s)
=== RUN TestStoragePool
--- PASS: TestStoragePool (0.00s)
=== RUN TestStorageVolume
--- PASS: TestStorageVolume (0.00s)
=== RUN TestRoundTrip
--- FAIL: TestRoundTrip (58.52s)
xml_test.go:374: testdata/libvirt/tests/domaincapsdata/qemu_1.5.3-q35.x86_64.xml: /domainCapabilities[0]/cpu[0]/mode[0]/enum[0]: element in expected XML missing in actual XML
FAIL
exit status 1
FAIL _/builds/libvirt/libvirt-go-xml 58.539s
Running after_script
Uploading artifacts for failed job
ERROR: Job failed: exit code 1
✖ build
go_1_14

Skipping Git submodules setup
Restoring cache
Downloading artifacts
Running before_script and script
$ go test -timeout 10m -tags xmlroundtrip -v
=== RUN TestDomainSnapshot
--- PASS: TestDomainSnapshot (0.00s)
=== RUN TestDomain
--- PASS: TestDomain (0.01s)
=== RUN TestNetwork
--- PASS: TestNetwork (0.00s)
=== RUN TestNodeDevice
--- PASS: TestNodeDevice (0.00s)
=== RUN TestSecret
--- PASS: TestSecret (0.00s)
=== RUN TestStoragePool
--- PASS: TestStoragePool (0.00s)
=== RUN TestStorageVolume
--- PASS: TestStorageVolume (0.00s)
=== RUN TestRoundTrip
TestRoundTrip: xml_test.go:374: testdata/libvirt/tests/domaincapsdata/qemu_1.5.3-q35.x86_64.xml: /domainCapabilities[0]/cpu[0]/mode[0]/enum[0]: element in expected XML missing in actual XML
--- FAIL: TestRoundTrip (59.45s)
FAIL
exit status 1
FAIL _/builds/libvirt/libvirt-go-xml 59.463s
Running after_script
Uploading artifacts for failed job
ERROR: Job failed: exit code 1
✖ build
go_1_10

Skipping Git submodules setup
Restoring cache
Downloading artifacts
Running before_script and script
$ go test -timeout 10m -tags xmlroundtrip -v
=== RUN TestDomainSnapshot
--- PASS: TestDomainSnapshot (0.00s)
=== RUN TestDomain
--- PASS: TestDomain (0.01s)
=== RUN TestNetwork
--- PASS: TestNetwork (0.00s)
=== RUN TestNodeDevice
--- PASS: TestNodeDevice (0.00s)
=== RUN TestSecret
--- PASS: TestSecret (0.00s)
=== RUN TestStoragePool
--- PASS: TestStoragePool (0.00s)
=== RUN TestStorageVolume
--- PASS: TestStorageVolume (0.00s)
=== RUN TestRoundTrip
--- FAIL: TestRoundTrip (59.33s)
xml_test.go:374: testdata/libvirt/tests/domaincapsdata/qemu_1.5.3-q35.x86_64.xml: /domainCapabilities[0]/cpu[0]/mode[0]/enum[0]: element in expected XML missing in actual XML
FAIL
exit status 1
FAIL _/builds/libvirt/libvirt-go-xml 59.344s
Running after_script
Uploading artifacts for failed job
ERROR: Job failed: exit code 1

[Date Prev][Date Next]   [Thread Prev][Thread Next]   [Thread Index] [Date Index] [Author Index]