[Date Prev][Date Next]   [Thread Prev][Thread Next]   [Thread Index] [Date Index] [Author Index]

libvirt-go-xml | Pipeline #156645691 has failed for master | 0df10bfd



Title: libvirt-go-xml | Pipeline #156645691 has failed for master | 0df10bfd
GitLab
✖ Your pipeline has failed.
 
Project libvirt / libvirt-go-xml
Branch
master
Commit
0df10bfd
Add support for migratable attribute on domain ...
Commit Author
Daniel Berrange
 
Pipeline #156645691 triggered by Erik Skultety
had 5 failed builds.
Logs may contain sensitive data. Please consider before forwarding this email.
✖ build
go_1_10

Skipping Git submodules setup
Restoring cache
Downloading artifacts
Running before_script and script
$ go test -timeout 10m -tags xmlroundtrip -v
=== RUN TestDomainSnapshot
--- PASS: TestDomainSnapshot (0.00s)
=== RUN TestDomain
--- PASS: TestDomain (0.01s)
=== RUN TestNetwork
--- PASS: TestNetwork (0.00s)
=== RUN TestNodeDevice
--- PASS: TestNodeDevice (0.00s)
=== RUN TestSecret
--- PASS: TestSecret (0.00s)
=== RUN TestStoragePool
--- PASS: TestStoragePool (0.00s)
=== RUN TestStorageVolume
--- PASS: TestStorageVolume (0.00s)
=== RUN TestRoundTrip
--- FAIL: TestRoundTrip (4.62s)
xml_test.go:374: testdata/libvirt/tests/networkxml2firewalldata/nat-ipv6-masquerade.xml: /network[0]/forward[0]/nat[0]/@ipv6: attribute 'yes' in expected XML missing in actual XML
FAIL
exit status 1
FAIL _/builds/libvirt/libvirt-go-xml 4.632s
Running after_script
Uploading artifacts for failed job
ERROR: Job failed: exit code 1
✖ build
go_1_14

Skipping Git submodules setup
Restoring cache
Downloading artifacts
Running before_script and script
$ go test -timeout 10m -tags xmlroundtrip -v
=== RUN TestDomainSnapshot
--- PASS: TestDomainSnapshot (0.00s)
=== RUN TestDomain
--- PASS: TestDomain (0.01s)
=== RUN TestNetwork
--- PASS: TestNetwork (0.00s)
=== RUN TestNodeDevice
--- PASS: TestNodeDevice (0.00s)
=== RUN TestSecret
--- PASS: TestSecret (0.00s)
=== RUN TestStoragePool
--- PASS: TestStoragePool (0.00s)
=== RUN TestStorageVolume
--- PASS: TestStorageVolume (0.00s)
=== RUN TestRoundTrip
TestRoundTrip: xml_test.go:374: testdata/libvirt/tests/networkxml2firewalldata/nat-ipv6-masquerade.xml: /network[0]/forward[0]/nat[0]/@ipv6: attribute 'yes' in expected XML missing in actual XML
--- FAIL: TestRoundTrip (4.84s)
FAIL
exit status 1
FAIL _/builds/libvirt/libvirt-go-xml 4.860s
Running after_script
Uploading artifacts for failed job
ERROR: Job failed: exit code 1
✖ build
go_1_11

Skipping Git submodules setup
Restoring cache
Downloading artifacts
Running before_script and script
$ go test -timeout 10m -tags xmlroundtrip -v
=== RUN TestDomainSnapshot
--- PASS: TestDomainSnapshot (0.00s)
=== RUN TestDomain
--- PASS: TestDomain (0.01s)
=== RUN TestNetwork
--- PASS: TestNetwork (0.00s)
=== RUN TestNodeDevice
--- PASS: TestNodeDevice (0.00s)
=== RUN TestSecret
--- PASS: TestSecret (0.00s)
=== RUN TestStoragePool
--- PASS: TestStoragePool (0.00s)
=== RUN TestStorageVolume
--- PASS: TestStorageVolume (0.00s)
=== RUN TestRoundTrip
--- FAIL: TestRoundTrip (4.93s)
xml_test.go:374: testdata/libvirt/tests/networkxml2firewalldata/nat-ipv6-masquerade.xml: /network[0]/forward[0]/nat[0]/@ipv6: attribute 'yes' in expected XML missing in actual XML
FAIL
exit status 1
FAIL _/builds/libvirt/libvirt-go-xml 4.942s
Running after_script
Uploading artifacts for failed job
ERROR: Job failed: exit code 1
✖ build
go_1_13

Skipping Git submodules setup
Restoring cache
Downloading artifacts
Running before_script and script
$ go test -timeout 10m -tags xmlroundtrip -v
=== RUN TestDomainSnapshot
--- PASS: TestDomainSnapshot (0.00s)
=== RUN TestDomain
--- PASS: TestDomain (0.01s)
=== RUN TestNetwork
--- PASS: TestNetwork (0.00s)
=== RUN TestNodeDevice
--- PASS: TestNodeDevice (0.00s)
=== RUN TestSecret
--- PASS: TestSecret (0.00s)
=== RUN TestStoragePool
--- PASS: TestStoragePool (0.00s)
=== RUN TestStorageVolume
--- PASS: TestStorageVolume (0.00s)
=== RUN TestRoundTrip
--- FAIL: TestRoundTrip (4.72s)
xml_test.go:374: testdata/libvirt/tests/networkxml2firewalldata/nat-ipv6-masquerade.xml: /network[0]/forward[0]/nat[0]/@ipv6: attribute 'yes' in expected XML missing in actual XML
FAIL
exit status 1
FAIL _/builds/libvirt/libvirt-go-xml 4.738s
Running after_script
Uploading artifacts for failed job
ERROR: Job failed: exit code 1
✖ build
go_1_12

Skipping Git submodules setup
Restoring cache
Downloading artifacts
Running before_script and script
$ go test -timeout 10m -tags xmlroundtrip -v
=== RUN TestDomainSnapshot
--- PASS: TestDomainSnapshot (0.00s)
=== RUN TestDomain
--- PASS: TestDomain (0.01s)
=== RUN TestNetwork
--- PASS: TestNetwork (0.00s)
=== RUN TestNodeDevice
--- PASS: TestNodeDevice (0.00s)
=== RUN TestSecret
--- PASS: TestSecret (0.00s)
=== RUN TestStoragePool
--- PASS: TestStoragePool (0.00s)
=== RUN TestStorageVolume
--- PASS: TestStorageVolume (0.00s)
=== RUN TestRoundTrip
--- FAIL: TestRoundTrip (4.83s)
xml_test.go:374: testdata/libvirt/tests/networkxml2firewalldata/nat-ipv6-masquerade.xml: /network[0]/forward[0]/nat[0]/@ipv6: attribute 'yes' in expected XML missing in actual XML
FAIL
exit status 1
FAIL _/builds/libvirt/libvirt-go-xml 4.845s
Running after_script
Uploading artifacts for failed job
ERROR: Job failed: exit code 1

[Date Prev][Date Next]   [Thread Prev][Thread Next]   [Thread Index] [Date Index] [Author Index]