[Date Prev][Date Next]   [Thread Prev][Thread Next]   [Thread Index] [Date Index] [Author Index]

libvirt-go-xml | Pipeline #157010940 has failed for master | 0df10bfd



Title: libvirt-go-xml | Pipeline #157010940 has failed for master | 0df10bfd
GitLab
✖ Your pipeline has failed.
 
Project libvirt / libvirt-go-xml
Branch
master
Commit
0df10bfd
Add support for migratable attribute on domain ...
Commit Author
Daniel Berrange
 
Pipeline #157010940 triggered by Daniel Berrange
had 5 failed builds.
Logs may contain sensitive data. Please consider before forwarding this email.
✖ build
go_1_14
Fetching changes...
Initialized empty Git repository in /builds/libvirt/libvirt-go-xml/.git/
Created fresh repository.
Checking out 0df10bfd as master...

Skipping Git submodules setup
Executing "step_script" stage of the job script
$ go test -timeout 10m -tags xmlroundtrip -v
=== RUN TestDomainSnapshot
--- PASS: TestDomainSnapshot (0.00s)
=== RUN TestDomain
--- PASS: TestDomain (0.01s)
=== RUN TestNetwork
--- PASS: TestNetwork (0.00s)
=== RUN TestNodeDevice
--- PASS: TestNodeDevice (0.00s)
=== RUN TestSecret
--- PASS: TestSecret (0.00s)
=== RUN TestStoragePool
--- PASS: TestStoragePool (0.00s)
=== RUN TestStorageVolume
--- PASS: TestStorageVolume (0.00s)
=== RUN TestRoundTrip
TestRoundTrip: xml_test.go:374: testdata/libvirt/tests/networkxml2firewalldata/nat-ipv6-masquerade.xml: /network[0]/forward[0]/nat[0]/@ipv6: attribute 'yes' in expected XML missing in actual XML
--- FAIL: TestRoundTrip (4.69s)
FAIL
exit status 1
FAIL _/builds/libvirt/libvirt-go-xml 4.707s
ERROR: Job failed: exit code 1
✖ build
go_1_13
Fetching changes...
Initialized empty Git repository in /builds/libvirt/libvirt-go-xml/.git/
Created fresh repository.
Checking out 0df10bfd as master...

Skipping Git submodules setup
Executing "step_script" stage of the job script
$ go test -timeout 10m -tags xmlroundtrip -v
=== RUN TestDomainSnapshot
--- PASS: TestDomainSnapshot (0.00s)
=== RUN TestDomain
--- PASS: TestDomain (0.01s)
=== RUN TestNetwork
--- PASS: TestNetwork (0.00s)
=== RUN TestNodeDevice
--- PASS: TestNodeDevice (0.00s)
=== RUN TestSecret
--- PASS: TestSecret (0.00s)
=== RUN TestStoragePool
--- PASS: TestStoragePool (0.00s)
=== RUN TestStorageVolume
--- PASS: TestStorageVolume (0.00s)
=== RUN TestRoundTrip
--- FAIL: TestRoundTrip (4.66s)
xml_test.go:374: testdata/libvirt/tests/networkxml2firewalldata/nat-ipv6-masquerade.xml: /network[0]/forward[0]/nat[0]/@ipv6: attribute 'yes' in expected XML missing in actual XML
FAIL
exit status 1
FAIL _/builds/libvirt/libvirt-go-xml 4.670s
ERROR: Job failed: exit code 1
✖ build
go_1_12
Fetching changes...
Initialized empty Git repository in /builds/libvirt/libvirt-go-xml/.git/
Created fresh repository.
Checking out 0df10bfd as master...

Skipping Git submodules setup
Executing "step_script" stage of the job script
$ go test -timeout 10m -tags xmlroundtrip -v
=== RUN TestDomainSnapshot
--- PASS: TestDomainSnapshot (0.00s)
=== RUN TestDomain
--- PASS: TestDomain (0.01s)
=== RUN TestNetwork
--- PASS: TestNetwork (0.00s)
=== RUN TestNodeDevice
--- PASS: TestNodeDevice (0.00s)
=== RUN TestSecret
--- PASS: TestSecret (0.00s)
=== RUN TestStoragePool
--- PASS: TestStoragePool (0.00s)
=== RUN TestStorageVolume
--- PASS: TestStorageVolume (0.00s)
=== RUN TestRoundTrip
--- FAIL: TestRoundTrip (4.53s)
xml_test.go:374: testdata/libvirt/tests/networkxml2firewalldata/nat-ipv6-masquerade.xml: /network[0]/forward[0]/nat[0]/@ipv6: attribute 'yes' in expected XML missing in actual XML
FAIL
exit status 1
FAIL _/builds/libvirt/libvirt-go-xml 4.545s
ERROR: Job failed: exit code 1
✖ build
go_1_11
Fetching changes...
Initialized empty Git repository in /builds/libvirt/libvirt-go-xml/.git/
Created fresh repository.
Checking out 0df10bfd as master...

Skipping Git submodules setup
Executing "step_script" stage of the job script
$ go test -timeout 10m -tags xmlroundtrip -v
=== RUN TestDomainSnapshot
--- PASS: TestDomainSnapshot (0.00s)
=== RUN TestDomain
--- PASS: TestDomain (0.01s)
=== RUN TestNetwork
--- PASS: TestNetwork (0.00s)
=== RUN TestNodeDevice
--- PASS: TestNodeDevice (0.00s)
=== RUN TestSecret
--- PASS: TestSecret (0.00s)
=== RUN TestStoragePool
--- PASS: TestStoragePool (0.00s)
=== RUN TestStorageVolume
--- PASS: TestStorageVolume (0.00s)
=== RUN TestRoundTrip
--- FAIL: TestRoundTrip (4.55s)
xml_test.go:374: testdata/libvirt/tests/networkxml2firewalldata/nat-ipv6-masquerade.xml: /network[0]/forward[0]/nat[0]/@ipv6: attribute 'yes' in expected XML missing in actual XML
FAIL
exit status 1
FAIL _/builds/libvirt/libvirt-go-xml 4.564s
ERROR: Job failed: exit code 1
✖ build
go_1_10
Fetching changes...
Initialized empty Git repository in /builds/libvirt/libvirt-go-xml/.git/
Created fresh repository.
Checking out 0df10bfd as master...

Skipping Git submodules setup
Executing "step_script" stage of the job script
$ go test -timeout 10m -tags xmlroundtrip -v
=== RUN TestDomainSnapshot
--- PASS: TestDomainSnapshot (0.00s)
=== RUN TestDomain
--- PASS: TestDomain (0.01s)
=== RUN TestNetwork
--- PASS: TestNetwork (0.00s)
=== RUN TestNodeDevice
--- PASS: TestNodeDevice (0.00s)
=== RUN TestSecret
--- PASS: TestSecret (0.00s)
=== RUN TestStoragePool
--- PASS: TestStoragePool (0.00s)
=== RUN TestStorageVolume
--- PASS: TestStorageVolume (0.00s)
=== RUN TestRoundTrip
--- FAIL: TestRoundTrip (4.42s)
xml_test.go:374: testdata/libvirt/tests/networkxml2firewalldata/nat-ipv6-masquerade.xml: /network[0]/forward[0]/nat[0]/@ipv6: attribute 'yes' in expected XML missing in actual XML
FAIL
exit status 1
FAIL _/builds/libvirt/libvirt-go-xml 4.440s
ERROR: Job failed: exit code 1

[Date Prev][Date Next]   [Thread Prev][Thread Next]   [Thread Index] [Date Index] [Author Index]